{"text_format":"1","workbook":"xlsx","n_sheets":5,"sheets":["Reconcile Example","Worksheet ExampleOld","Worksheet Example","Worksheet (blank) template","Tax Codes"],"not_rendered":{"charts":0,"images":4,"macros":1,"external_links":3,"defined_names":19,"comments":0,"pivot_tables":0},"unopened":[],"bounds":{"document_bytes":16777216,"sheet_cells":100000,"rows_first":2000,"rows_last":500,"rows_between":2000,"halvings":0,"cell_chars":16384,"cell_head_chars":4096},"cells_cut":0,"cells_raw":0,"read":"whole","date_system":"1900"}

{"sheet":"Reconcile Example","index":0,"n_rows":49,"n_cols":5,"rows_kept":49,"cut":false,"hidden":false,"merged":[]}
["Facts:"]
[null,"Accounts Receivable"]
[null,null,null,"Opening","Closing"]
[]
[null,"Wheat",null,50000,30000]
[null,"Crop Insurance",null,20000,"-"]
[null,"Barley",null,10000,"-"]
[null,null,null,80000,30000]
[]
[null,"Accounts Payable"]
[null,null,null,"Opening","Closing"]
[]
[null,"Cattle",null,150000,25000]
[null,"Equipment rental",null,"-",5000]
[null,"Accounting fees",null,5000,3000]
[null,"Fuel & oil",null,2000,"-"]
[null,"Agriculture contract work",null,2000]
[null,null,null,159000,263000]
[]
[null,"Prepaid Expenses"]
[null,null,null,"Opening","Closing"]
[]
[null,"Fertilizer",null,20000,50000]
[]
[]
["Reconciliation of Net Income for Tax Purposes T2 Schedule 1"]
[]
[null,"Net Income per Financial Statements",null,null,90000]
[]
["Add:","Depreciation",null,70000]
[null,"Opening inventory",null,800000]
[null,"Opening accounts receivable / prepaid",null,100000]
[null,"Closing accounts payable",null,263000]
[null,"Current year optional inventory adj",null,120000]
[null,null,null,null,1353000]
[]
["Deduct:","Dividend income",null,50000]
[null,"Closing inventory",null,60000]
[null,"Closing accounts receivable / prepaid",null,80000]
[null,"Opening accounts payable",null,159000]
[null,"Prior year optional inventory adj",null,140000]
[null,"Gain on sale",null,4000]
[null,"Capital cost allowance",null,80000]
[null,null,null,null,1113000]
[]
["Income from Business or Property"]
[null,"Taxable capital gain",null,null,3000]
[]
["Net Income for Tax Purposes",null,null,null,333000]

{"sheet":"Worksheet ExampleOld","index":1,"n_rows":132,"n_cols":10,"rows_kept":132,"cut":false,"hidden":true,"merged":[[11,1,11,2],[17,1,17,2],[18,1,18,2],[19,1,19,2],[20,1,20,2],[0,4,0,6],[0,8,0,9],[30,1,30,2],[12,1,12,2],[5,1,5,2],[6,1,6,2],[7,1,7,2],[8,1,8,2],[9,1,9,2],[10,1,10,2],[27,1,27,2],[28,1,28,2],[29,1,29,2],[32,1,32,3],[38,1,38,2],[21,1,21,2],[22,1,22,2],[23,1,23,2],[24,1,24,2],[25,1,25,2],[26,1,26,2],[52,1,52,2],[53,1,53,2],[54,1,54,2],[55,1,55,2],[56,1,56,2],[60,1,60,2],[39,1,39,2],[47,1,47,2],[48,1,48,2],[49,1,49,2],[50,1,50,2],[51,1,51,2],[67,1,67,2],[68,1,68,2],[69,1,69,2],[70,1,70,2],[71,1,71,2],[73,1,73,2],[61,1,61,2],[62,1,62,2],[63,1,63,2],[64,1,64,2],[65,1,65,2],[66,1,66,2],[72,1,72,2],[74,1,74,2],[75,1,75,2],[79,1,79,2],[92,1,92,2],[93,1,93,2],[94,1,94,2],[85,1,85,2],[86,1,86,2],[87,1,87,2],[88,1,88,2],[80,1,80,2],[81,1,81,2],[82,1,82,2],[83,1,83,2],[84,1,84,2],[95,1,95,2],[96,1,96,2],[97,1,97,2],[98,1,98,2],[89,1,89,2],[90,1,90,2],[91,1,91,2],[104,1,104,2],[109,4,109,5],[101,1,101,2],[102,1,102,2],[103,1,103,2],[105,1,105,2],[99,1,99,2],[100,1,100,2],[113,6,113,7],[114,6,114,7],[115,6,115,7],[116,6,116,7],[111,1,111,2],[112,1,112,2],[113,1,113,2],[114,1,114,2],[115,1,115,2],[116,1,116,2],[131,1,131,2],[125,1,125,2],[109,8,109,9],[125,6,125,7],[127,1,127,2],[129,1,129,2],[130,1,130,2],[117,6,117,7],[118,6,118,7],[119,6,119,7],[120,6,120,7],[122,6,122,7],[123,6,123,7],[121,6,121,7],[117,1,117,2],[118,1,118,2],[119,1,119,2],[123,1,123,2],[121,1,121,2],[120,1,120,2],[122,1,122,2],[110,6,110,7],[111,6,111,7],[112,6,112,7]]}
[null,null,null,null,"Financial Statements:\nStatement of Income (Loss)",null,null,null,"Net Income (Loss)\nfor Income Tax Purposes"]
[null,"Revenue"]
[]
[null,null,null,"T1163",null,"Opening",null,"Closing"]
[null,"Commodity Sales and Program Payments",null,"Code","Accrual   +","Receivables","-","Receivables","=","Cash/Tax"]
[null,"Wheat",null,56,200000,50000,null,30000,null,{"$f":"E6+F6-H6","v":220000}]
[null,"Barley",null,3,300000,10000,null,null,null,{"$f":"E7+F7-H7","v":310000}]
[null,"Oats",null,45,56000,null,null,null,null,56000]
[null,"Cattle, Feeder",null,721,1200000,null,null,null,null,1200000]
[null,"Crop Insurance: Grains & Oilseeds",null,401,40000,20000,null,null,null,60000]
[null,null,null,null,null,null,null,null,null,0]
[null,null,null,null,null,null,null,null,null,0]
[null,"Total A",null,9950,{"$f":"SUM(E6:E12)","v":1796000},{"$f":"SUM(F6:F12)","v":80000},null,{"$f":"SUM(H6:H12)","v":30000},null,{"$f":"SUM(J6:J12)","v":1846000}]
[]
[null,null,null,null,null,"Opening",null,"Closing"]
[null,"Other Farming Income",null,"Line","Accrual +","Receivables","-","Receivables","=","Cash/Tax"]
[null,"Other program payments",null,9540]
[null,"Business Risk Management (BRM) and disaster assistance program payments",null,9544]
[null,"Resales, Rebates, GST/HST for allowable exp",null,9574]
[null,"Resales, Rebates, GST/HST for non-allowable expenses",null,9575]
[null,"Agricultural contract work",null,9601]
[null,"Patronage dividends",null,9605]
[null,"Interest",null,9607]
[null,"Gravel",null,9610]
[null,"Trucking (farm - related only)",null,9611]
[null,"Resales of commodities purchased",null,9612]
[null,"Leases (gas, oil well, surface, etc.)",null,9613]
[null,"Machine rentals",null,9614]
[null,"Other (specify)",null,9600]
[]
[null,"Total B",null,null,"-","-",null,"-",null,"-"]
[]
[null,"Total Revenue (Total A + Total B)",null,null,1796000,80000,null,30000,null,1846000]
[]
[null,"Inventory"]
[]
[null,null,null,null,"Accrual",null,"Opening",null,"Closing"]
[null,null,null,null,null,null,"Inventories",null,"Inventories","Cash/Tax"]
[null,"Opening Inventory",null,null,800000,null,-800000]
[null,"Closing Inventory",null,null,600000,null,null,null,-600000]
[]
[null,"Change in Inventory",null,null,-200000,null,800000,null,-600000]
[]
[null,"Expenses"]
[]
[null," Commodity Purchases and",null,"T1163",null,"Opening","Closing","Closing","Opening"]
[null,"Repayment of Program Benefits",null,"Code","Accrual","+ Payables","+ Prepaids","- Payables","- Prepaids","Cash/Tax"]
[null,"Point of Sale Adjustments",null,575,null,null,null,null,null,{"$f":"F48+G48-H48-I48","v":0}]
[null,"Forage (Including Pellets, Silage)",null,{"$f":"IF(B49=\"\",\"\",VLOOKUP(B49,[3]!AllowableCode,2,FALSE))","v":264},675000,null,null,null,null,{"$f":"F49+G49-H49-I49","v":0}]
[null,"Wheat",null,{"$f":"IF(B50=\"\",\"\",VLOOKUP(B50,[3]!AllowableCode,2,FALSE))","v":56},10000,null,null,null,null,0]
[null,"Barley",null,{"$f":"IF(B51=\"\",\"\",VLOOKUP(B51,[3]!AllowableCode,2,FALSE))","v":3},10000,null,null,null,null,0]
[null,"Oats",null,{"$f":"IF(B52=\"\",\"\",VLOOKUP(B52,[3]!AllowableCode,2,FALSE))","v":45},5000,null,null,null,null,0]
[null,"Cattle, Feeder",null,{"$f":"IF(B53=\"\",\"\",VLOOKUP(B53,[3]!AllowableCode,2,FALSE))","v":721},500000,150000,null,250000,null,-100000]
[null,null,null,null,null,null,null,null,null,0]
[null,null,null,null,null,null,null,null,null,0]
[null,null,null,null,null,null,null,null,null,0]
[null,"Total C",null,null,{"$f":"SUM(E48:E56)","v":1200000},{"$f":"SUM(F48:F56)","v":150000},0,250000,0,{"$f":"SUM(J48:J56)","v":-100000}]
[]
[null,null,null,null,null,"Opening","Closing","Closing","Opening"]
[null,"Allowable Expenses",null,"Line","Accrual","+ Payables  ","+ Prepaids  ","- Payables  ","- Prepaids  ","= Cash/Tax"]
{"$rows_left_out":73}
{"sheet":"Worksheet Example","index":2,"n_rows":196,"n_cols":10,"rows_kept":196,"cut":false,"hidden":false,"merged":[[194,1,194,9],[195,3,195,4],[195,5,195,6],[195,8,195,9],[181,1,181,2],[181,6,181,7],[184,1,184,2],[186,1,186,2],[187,1,187,2],[188,1,188,2],[191,1,191,9],[177,1,177,2],[177,6,177,7],[178,1,178,2],[178,6,178,7],[179,1,179,2],[179,6,179,7],[174,1,174,2],[174,6,174,7],[175,1,175,2],[175,6,175,7],[176,1,176,2],[176,6,176,7],[171,1,171,2],[171,6,171,7],[172,1,172,2],[172,6,172,7],[173,1,173,2],[173,6,173,7],[168,1,168,2],[168,6,168,7],[169,1,169,2],[169,6,169,7],[170,1,170,2],[170,6,170,7],[165,1,165,2],[165,6,165,7],[166,1,166,2],[166,6,166,7],[167,1,167,2],[167,6,167,7],[162,1,162,2],[162,6,162,7],[163,1,163,2],[163,6,163,7],[164,1,164,2],[164,6,164,7],[158,6,158,7],[159,1,159,2],[159,6,159,7],[160,1,160,2],[160,6,160,7],[161,1,161,2],[161,6,161,7],[149,1,149,2],[150,1,150,2],[151,1,151,2],[152,1,152,2],[157,4,157,5],[157,8,157,9],[143,1,143,2],[144,1,144,2],[145,1,145,2],[146,1,146,2],[147,1,147,2],[148,1,148,2],[137,1,137,2],[138,1,138,2],[139,1,139,2],[140,1,140,2],[141,1,141,2],[142,1,142,2],[131,1,131,2],[132,1,132,2],[133,1,133,2],[134,1,134,2],[135,1,135,2],[136,1,136,2],[125,1,125,2],[126,1,126,2],[127,1,127,2],[128,1,128,2],[129,1,129,2],[130,1,130,2],[116,1,116,2],[117,1,117,2],[118,1,118,2],[122,1,122,2],[123,1,123,2],[124,1,124,2],[110,1,110,2],[111,1,111,2],[112,1,112,2],[113,1,113,2],[114,1,114,2],[115,1,115,2],[104,1,104,2],[105,1,105,2],[106,1,106,2],[107,1,107,2],[108,1,108,2],[109,1,109,2],[95,1,95,2],[96,1,96,2],[97,1,97,2],[101,1,101,2],[102,1,102,2],[103,1,103,2],[89,1,89,2],[90,1,90,2],[91,1,91,2],[92,1,92,2],[93,1,93,2],[94,1,94,2],[83,1,83,2],[84,1,84,2],[85,1,85,2],[86,1,86,2],[87,1,87,2],[88,1,88,2],[77,1,77,2],[78,1,78,2],[79,1,79,2],[80,1,80,2],[81,1,81,2],[82,1,82,2],[56,1,56,2],[58,1,58,3],[60,1,61,1],[60,8,61,9],[66,1,66,2],[67,1,67,2],[50,1,50,2],[51,1,51,2],[52,1,52,2],[53,1,53,2],[54,1,54,2],[55,1,55,2],[44,1,44,2],[45,1,45,2],[46,1,46,2],[47,1,47,2],[48,1,48,2],[49,1,49,2],[34,1,34,2],[35,1,35,2],[40,1,40,2],[41,1,41,2],[42,1,42,2],[43,1,43,2],[28,1,28,2],[29,1,29,2],[30,1,30,2],[31,1,31,2],[32,1,32,2],[33,1,33,2],[22,1,22,2],[23,1,23,2],[24,1,24,2],[25,1,25,2],[26,1,26,2],[27,1,27,2],[17,1,17,2],[18,1,18,2],[19,1,19,2],[20,1,20,2],[21,1,21,2],[7,4,7,6],[7,7,7,9],[12,1,12,2],[13,1,13,2],[14,1,14,2],[15,1,15,2],[3,1,3,2],[3,3,3,4],[3,5,3,6],[3,7,3,8],[4,1,4,2],[4,3,4,4],[4,5,4,6],[4,7,4,8],[16,1,16,2]]}
[null,null,null,"Fiscal Period:","Year",null,"Month",null,"Day"]
[]
[]
[null,"Business Name",null,"Identification Number",null,"Subscription",null,"AgriStability PIN",null,"Year"]
[]
[]
[]
[null,null,null,null,"Financial Statements:\nStatement of Income (Loss)",null,null,"Net Income (Loss)\nfor Income Tax Purposes"]
[null,"Revenue"]
[]
[null,null,null,"T1163",null,"Opening",null,"Closing"]
[null,"Commodity Sales and Program Payments",null,"Code","Accrual   +","Receivables","-","Receivables","=","Cash/Tax"]
[null,null,null,{"$f":"IF(ISBLANK(B13),\"\",VLOOKUP(B13,'Tax Codes'!$A$2:$B$305,2,FALSE))","v":""},null,null,null,null,null,{"$f":"(E13+F13-H13)","v":0}]
[null,null,null,{"$f":"IF(ISBLANK(B14),\"\",VLOOKUP(B14,'Tax Codes'!$A$2:$B$305,2,FALSE))","v":""},null,null,null,null,null,{"$f":"(E14+F14-H14)","v":0}]
[null,null,null,{"$f":"IF(ISBLANK(B15),\"\",VLOOKUP(B15,'Tax Codes'!$A$2:$B$305,2,FALSE))","v":""},null,null,null,null,null,0]
[null,null,null,{"$f":"IF(ISBLANK(B16),\"\",VLOOKUP(B16,'Tax Codes'!$A$2:$B$305,2,FALSE))","v":""},null,null,null,null,null,0]
[null,null,null,{"$f":"IF(ISBLANK(B17),\"\",VLOOKUP(B17,'Tax Codes'!$A$2:$B$305,2,FALSE))","v":""},null,null,null,null,null,0]
[null,null,null,{"$f":"IF(ISBLANK(B18),\"\",VLOOKUP(B18,'Tax Codes'!$A$2:$B$305,2,FALSE))","v":""},null,null,null,null,null,0]
[null,null,null,{"$f":"IF(ISBLANK(B19),\"\",VLOOKUP(B19,'Tax Codes'!$A$2:$B$305,2,FALSE))","v":""},null,null,null,null,null,0]
[null,null,null,{"$f":"IF(ISBLANK(B20),\"\",VLOOKUP(B20,'Tax Codes'!$A$2:$B$305,2,FALSE))","v":""},null,null,null,null,null,0]
[null,null,null,{"$f":"IF(ISBLANK(B21),\"\",VLOOKUP(B21,'Tax Codes'!$A$2:$B$305,2,FALSE))","v":""},null,null,null,null,null,0]
[null,null,null,{"$f":"IF(ISBLANK(B22),\"\",VLOOKUP(B22,'Tax Codes'!$A$2:$B$305,2,FALSE))","v":""},null,null,null,null,null,0]
[null,null,null,{"$f":"IF(ISBLANK(B23),\"\",VLOOKUP(B23,'Tax Codes'!$A$2:$B$305,2,FALSE))","v":""},null,null,null,null,null,0]
[null,null,null,{"$f":"IF(ISBLANK(B24),\"\",VLOOKUP(B24,'Tax Codes'!$A$2:$B$305,2,FALSE))","v":""},null,null,null,null,null,0]
[null,null,null,{"$f":"IF(ISBLANK(B25),\"\",VLOOKUP(B25,'Tax Codes'!$A$2:$B$305,2,FALSE))","v":""},null,null,null,null,null,0]
[null,null,null,{"$f":"IF(ISBLANK(B26),\"\",VLOOKUP(B26,'Tax Codes'!$A$2:$B$305,2,FALSE))","v":""},null,null,null,null,null,0]
[null,null,null,{"$f":"IF(ISBLANK(B27),\"\",VLOOKUP(B27,'Tax Codes'!$A$2:$B$305,2,FALSE))","v":""},null,null,null,null,null,0]
[null,null,null,{"$f":"IF(ISBLANK(B28),\"\",VLOOKUP(B28,'Tax Codes'!$A$2:$B$305,2,FALSE))","v":""},null,null,null,null,null,0]
[null,null,null,{"$f":"IF(ISBLANK(B29),\"\",VLOOKUP(B29,'Tax Codes'!$A$2:$B$305,2,FALSE))","v":""},null,null,null,null,null,0]
[null,null,null,{"$f":"IF(ISBLANK(B30),\"\",VLOOKUP(B30,'Tax Codes'!$A$2:$B$305,2,FALSE))","v":""},null,null,null,null,null,0]
[null,null,null,{"$f":"IF(ISBLANK(B31),\"\",VLOOKUP(B31,'Tax Codes'!$A$2:$B$305,2,FALSE))","v":""},null,null,null,null,null,0]
[null,null,null,{"$f":"IF(ISBLANK(B32),\"\",VLOOKUP(B32,'Tax Codes'!$A$2:$B$305,2,FALSE))","v":""},null,null,null,null,null,0]
[null,null,null,{"$f":"IF(ISBLANK(B33),\"\",VLOOKUP(B33,'Tax Codes'!$A$2:$B$305,2,FALSE))","v":""},null,null,null,null,null,0]
[null,null,null,{"$f":"IF(ISBLANK(B34),\"\",VLOOKUP(B34,'Tax Codes'!$A$2:$B$305,2,FALSE))","v":""},null,null,null,null,null,0]
[null,null,null,{"$f":"IF(ISBLANK(B35),\"\",VLOOKUP(B35,'Tax Codes'!$A$2:$B$305,2,FALSE))","v":""},null,null,null,null,null,0]
[null,"Total A",null,null,{"$f":"SUM(E13:E35)","v":0},{"$f":"SUM(F13:F35)","v":0},null,{"$f":"SUM(H13:H35)","v":0},null,{"$f":"SUM(J13:J35)","v":0}]
[]
[null,null,null,null,null,"Opening",null,"Closing"]
[null,"Other Farming Income",null,"Line","Accrual +","Receivables","-","Receivables","=","Cash/Tax"]
[null,"Other program payments",null,9540,null,null,null,null,null,{"$f":"(E40+F40-H40)","v":0}]
[null,"Business Risk Management (BRM) and disaster assistance program payments",null,9544,null,null,null,null,null,{"$f":"(E41+F41-H41)","v":0}]
[null,"Resales, Rebates, GST/HST for allowable exp",null,9574,null,null,null,null,null,0]
[null,"Resales, Rebates, GST/HST for non-allowable expenses",null,9575,null,null,null,null,null,0]
[null,"Agricultural contract work",null,9601,null,null,null,null,null,0]
[null,"Patronage dividends",null,9605,null,null,null,null,null,0]
[null,"Interest",null,9607,null,null,null,null,null,0]
[null,"Gravel",null,9610,null,null,null,null,null,0]
[null,"Trucking (farm - related only)",null,9611,null,null,null,null,null,0]
[null,"Resales of commodities purchased",null,9612,null,null,null,null,null,0]
[null,"Leases (gas, oil well, surface, etc.)",null,9613,null,null,null,null,null,0]
[null,"Machine rentals",null,9614,null,null,null,null,null,0]
[null,"Other (specify)",null,9600,null,null,null,null,null,0]
[null,null,null,null,null,null,null,null,null,0]
[null,null,null,null,null,null,null,null,null,0]
[null,null,null,null,null,null,null,null,null,{"$f":"(E55+F55-H55)","v":0}]
[null,null,null,null,null,null,null,null,null,0]
[null,"Total B",null,null,{"$f":"SUM(E40:E56)","v":0},{"$f":"SUM(F40:F56)","v":0},null,{"$f":"SUM(H40:H56)","v":0},null,{"$f":"SUM(J40:J56)","v":0}]
[]
[null,"Total Revenue (Total A + Total B)",null,null,{"$f":"(E36+E57)","v":0},{"$f":"(F36+F57)","v":0},null,{"$f":"(H36+H57)","v":0},null,{"$f":"(J36+J57)","v":0}]
[]
{"$rows_left_out":137}
{"sheet":"Worksheet (blank) template","index":3,"n_rows":196,"n_cols":10,"rows_kept":196,"cut":false,"hidden":false,"merged":[[12,1,12,2],[13,1,13,2],[14,1,14,2],[15,1,15,2],[3,1,3,2],[3,3,3,4],[3,5,3,6],[3,7,3,8],[16,1,16,2],[4,3,4,4],[17,1,17,2],[34,1,34,2],[35,1,35,2],[40,1,40,2],[41,1,41,2],[27,1,27,2],[28,1,28,2],[29,1,29,2],[30,1,30,2],[23,1,23,2],[24,1,24,2],[25,1,25,2],[26,1,26,2],[31,1,31,2],[32,1,32,2],[33,1,33,2],[48,1,48,2],[49,1,49,2],[50,1,50,2],[51,1,51,2],[55,1,55,2],[56,1,56,2],[42,1,42,2],[43,1,43,2],[44,1,44,2],[45,1,45,2],[46,1,46,2],[47,1,47,2],[54,1,54,2],[52,1,52,2],[53,1,53,2],[58,1,58,3],[66,1,66,2],[67,1,67,2],[77,1,77,2],[86,1,86,2],[87,1,87,2],[60,1,61,1],[78,1,78,2],[79,1,79,2],[80,1,80,2],[81,1,81,2],[82,1,82,2],[83,1,83,2],[84,1,84,2],[85,1,85,2],[97,1,97,2],[101,1,101,2],[102,1,102,2],[103,1,103,2],[104,1,104,2],[105,1,105,2],[88,1,88,2],[89,1,89,2],[94,1,94,2],[95,1,95,2],[96,1,96,2],[91,1,91,2],[92,1,92,2],[93,1,93,2],[90,1,90,2],[112,1,112,2],[113,1,113,2],[114,1,114,2],[118,1,118,2],[122,1,122,2],[117,1,117,2],[115,1,115,2],[116,1,116,2],[106,1,106,2],[107,1,107,2],[108,1,108,2],[109,1,109,2],[110,1,110,2],[111,1,111,2],[140,1,140,2],[129,1,129,2],[130,1,130,2],[131,1,131,2],[132,1,132,2],[133,1,133,2],[134,1,134,2],[123,1,123,2],[124,1,124,2],[125,1,125,2],[126,1,126,2],[127,1,127,2],[128,1,128,2],[135,1,135,2],[136,1,136,2],[137,1,137,2],[138,1,138,2],[139,1,139,2],[157,8,157,9],[158,6,158,7],[159,1,159,2],[159,6,159,7],[141,1,141,2],[142,1,142,2],[143,1,143,2],[144,1,144,2],[145,1,145,2],[150,1,150,2],[146,1,146,2],[147,1,147,2],[148,1,148,2],[149,1,149,2],[151,1,151,2],[152,1,152,2],[157,4,157,5],[187,1,187,2],[188,1,188,2],[173,1,173,2],[173,6,173,7],[174,1,174,2],[174,6,174,7],[179,1,179,2],[179,6,179,7],[178,6,178,7],[177,1,177,2],[177,6,177,7],[181,1,181,2],[175,1,175,2],[186,1,186,2],[175,6,175,7],[176,1,176,2],[176,6,176,7],[178,1,178,2],[160,1,160,2],[161,1,161,2],[162,1,162,2],[164,1,164,2],[181,6,181,7],[184,1,184,2],[160,6,160,7],[161,6,161,7],[162,6,162,7],[170,6,170,7],[171,6,171,7],[172,6,172,7],[167,6,167,7],[168,6,168,7],[169,6,169,7],[170,1,170,2],[171,1,171,2],[172,1,172,2],[168,1,168,2],[169,1,169,2],[191,1,191,9],[167,1,167,2],[195,5,195,6],[195,8,195,9],[4,1,4,2],[4,5,4,6],[4,7,4,8],[194,1,194,9],[195,3,195,4],[7,4,7,6],[60,8,61,9],[7,7,7,9],[18,1,18,2],[19,1,19,2],[20,1,20,2],[21,1,21,2],[22,1,22,2],[166,1,166,2],[166,6,166,7],[165,1,165,2],[165,6,165,7],[163,1,163,2],[163,6,163,7],[164,6,164,7]]}
[null,null,null,"Fiscal Period:","Year",null,"Month",null,"Day"]
[]
[]
[null,"Business Name",null,"Identification Number",null,"Subscription",null,"AgriStability PIN",null,"Year"]
[]
[]
[]
[null,null,null,null,"Financial Statements:\nStatement of Income (Loss)",null,null,"Net Income (Loss)\nfor Income Tax Purposes"]
[null,"Revenue"]
[]
[null,null,null,"T1163",null,"Opening",null,"Closing"]
[null,"Commodity Sales and Program Payments",null,"Code","Accrual   +","Receivables","-","Receivables","=","Cash/Tax"]
[null,null,null,{"$f":"IF(ISBLANK(B13),\"\",VLOOKUP(B13,'Tax Codes'!$A$2:$B$305,2,FALSE))","v":""},null,null,null,null,null,{"$f":"(E13+F13-H13)","v":0}]
[null,null,null,{"$f":"IF(ISBLANK(B14),\"\",VLOOKUP(B14,'Tax Codes'!$A$2:$B$305,2,FALSE))","v":""},null,null,null,null,null,{"$f":"(E14+F14-H14)","v":0}]
[null,null,null,{"$f":"IF(ISBLANK(B15),\"\",VLOOKUP(B15,'Tax Codes'!$A$2:$B$305,2,FALSE))","v":""},null,null,null,null,null,0]
[null,null,null,{"$f":"IF(ISBLANK(B16),\"\",VLOOKUP(B16,'Tax Codes'!$A$2:$B$305,2,FALSE))","v":""},null,null,null,null,null,0]
[null,null,null,{"$f":"IF(ISBLANK(B17),\"\",VLOOKUP(B17,'Tax Codes'!$A$2:$B$305,2,FALSE))","v":""},null,null,null,null,null,0]
[null,null,null,{"$f":"IF(ISBLANK(B18),\"\",VLOOKUP(B18,'Tax Codes'!$A$2:$B$305,2,FALSE))","v":""},null,null,null,null,null,0]
[null,null,null,{"$f":"IF(ISBLANK(B19),\"\",VLOOKUP(B19,'Tax Codes'!$A$2:$B$305,2,FALSE))","v":""},null,null,null,null,null,0]
[null,null,null,{"$f":"IF(ISBLANK(B20),\"\",VLOOKUP(B20,'Tax Codes'!$A$2:$B$305,2,FALSE))","v":""},null,null,null,null,null,0]
[null,null,null,{"$f":"IF(ISBLANK(B21),\"\",VLOOKUP(B21,'Tax Codes'!$A$2:$B$305,2,FALSE))","v":""},null,null,null,null,null,0]
[null,null,null,{"$f":"IF(ISBLANK(B22),\"\",VLOOKUP(B22,'Tax Codes'!$A$2:$B$305,2,FALSE))","v":""},null,null,null,null,null,0]
[null,null,null,{"$f":"IF(ISBLANK(B23),\"\",VLOOKUP(B23,'Tax Codes'!$A$2:$B$305,2,FALSE))","v":""},null,null,null,null,null,0]
[null,null,null,{"$f":"IF(ISBLANK(B24),\"\",VLOOKUP(B24,'Tax Codes'!$A$2:$B$305,2,FALSE))","v":""},null,null,null,null,null,0]
[null,null,null,{"$f":"IF(ISBLANK(B25),\"\",VLOOKUP(B25,'Tax Codes'!$A$2:$B$305,2,FALSE))","v":""},null,null,null,null,null,0]
[null,null,null,{"$f":"IF(ISBLANK(B26),\"\",VLOOKUP(B26,'Tax Codes'!$A$2:$B$305,2,FALSE))","v":""},null,null,null,null,null,0]
[null,null,null,{"$f":"IF(ISBLANK(B27),\"\",VLOOKUP(B27,'Tax Codes'!$A$2:$B$305,2,FALSE))","v":""},null,null,null,null,null,0]
[null,null,null,{"$f":"IF(ISBLANK(B28),\"\",VLOOKUP(B28,'Tax Codes'!$A$2:$B$305,2,FALSE))","v":""},null,null,null,null,null,0]
[null,null,null,{"$f":"IF(ISBLANK(B29),\"\",VLOOKUP(B29,'Tax Codes'!$A$2:$B$305,2,FALSE))","v":""},null,null,null,null,null,0]
[null,null,null,{"$f":"IF(ISBLANK(B30),\"\",VLOOKUP(B30,'Tax Codes'!$A$2:$B$305,2,FALSE))","v":""},null,null,null,null,null,0]
[null,null,null,{"$f":"IF(ISBLANK(B31),\"\",VLOOKUP(B31,'Tax Codes'!$A$2:$B$305,2,FALSE))","v":""},null,null,null,null,null,0]
[null,null,null,{"$f":"IF(ISBLANK(B32),\"\",VLOOKUP(B32,'Tax Codes'!$A$2:$B$305,2,FALSE))","v":""},null,null,null,null,null,0]
[null,null,null,{"$f":"IF(ISBLANK(B33),\"\",VLOOKUP(B33,'Tax Codes'!$A$2:$B$305,2,FALSE))","v":""},null,null,null,null,null,0]
[null,null,null,{"$f":"IF(ISBLANK(B34),\"\",VLOOKUP(B34,'Tax Codes'!$A$2:$B$305,2,FALSE))","v":""},null,null,null,null,null,0]
[null,null,null,{"$f":"IF(ISBLANK(B35),\"\",VLOOKUP(B35,'Tax Codes'!$A$2:$B$305,2,FALSE))","v":""},null,null,null,null,null,0]
[null,"Total A",null,null,{"$f":"SUM(E13:E35)","v":0},{"$f":"SUM(F13:F35)","v":0},null,{"$f":"SUM(H13:H35)","v":0},null,{"$f":"SUM(J13:J35)","v":0}]
[]
[null,null,null,null,null,"Opening",null,"Closing"]
[null,"Other Farming Income",null,"Line","Accrual +","Receivables","-","Receivables","=","Cash/Tax"]
[null,"Other program payments",null,9540,null,null,null,null,null,{"$f":"(E40+F40-H40)","v":0}]
[null,"Business Risk Management (BRM) and disaster assistance program payments",null,9544,null,null,null,null,null,{"$f":"(E41+F41-H41)","v":0}]
[null,"Resales, Rebates, GST/HST for allowable exp",null,9574,null,null,null,null,null,0]
[null,"Resales, Rebates, GST/HST for non-allowable expenses",null,9575,null,null,null,null,null,0]
[null,"Agricultural contract work",null,9601,null,null,null,null,null,0]
[null,"Patronage dividends",null,9605,null,null,null,null,null,0]
[null,"Interest",null,9607,null,null,null,null,null,0]
[null,"Gravel",null,9610,null,null,null,null,null,0]
[null,"Trucking (farm - related only)",null,9611,null,null,null,null,null,0]
[null,"Resales of commodities purchased",null,9612,null,null,null,null,null,0]
[null,"Leases (gas, oil well, surface, etc.)",null,9613,null,null,null,null,null,0]
[null,"Machine rentals",null,9614,null,null,null,null,null,0]
[null,"Other (specify)",null,9600,null,null,null,null,null,0]
[null,null,null,null,null,null,null,null,null,0]
[null,null,null,null,null,null,null,null,null,0]
[null,null,null,null,null,null,null,null,null,{"$f":"(E55+F55-H55)","v":0}]
[null,null,null,null,null,null,null,null,null,0]
[null,"Total B",null,null,{"$f":"SUM(E40:E56)","v":0},{"$f":"SUM(F40:F56)","v":0},null,{"$f":"SUM(H40:H56)","v":0},null,{"$f":"SUM(J40:J56)","v":0}]
[]
[null,"Total Revenue (Total A + Total B)",null,null,{"$f":"(E36+E57)","v":0},{"$f":"(F36+F57)","v":0},null,{"$f":"(H36+H57)","v":0},null,{"$f":"(J36+J57)","v":0}]
[]
{"$rows_left_out":137}
{"sheet":"Tax Codes","index":4,"n_rows":305,"n_cols":2,"rows_kept":305,"cut":false,"hidden":false,"merged":[]}
["Commodity and Allowable Program Payment Tax Codes","Code"]
["(CFIA) Payment for allowable commodities",663]
["(CFIA) Payment for other amounts",665]
["(CFIA) Payment for supply managed commodities",664]
["2021 CAN-AB Hog Recovery Initiative",778]
["2021 CAN-AB Livestock Feed Assist. Initiative (Allowable) ",776]
["2021 CAN-AB Livestock Feed Assist. Initiative (Non-Allowable)",775]
["AgriRecovery Bee Assistance Payments (allowable portion)",800]
["AgriRecovery Drought Assist. Payments (Allowable)",774]
["AgriRecovery Drought Assist. Payments (Non-Allowable) ",773]
["AgriRecovery Feed Assistance Payments (allowable portion)",801]
["AgriRecovery Flood Assistance Payments (allowable portion)",802]
["Alberta Spring Price Endorsement",495]
["Alpacas",370]
["Alternate Land Use Services (ALUS)",557]
["Anise",101]
["Apples",60]
["Apricots",91]
["Artichokes",160]
["Arugula / Rocket",195]
["Asparagus",161]
["Barley",3]
["Basil",102]
["Beans (Dry Edible)",4]
["Beans, Fresh",25]
["Bedding Plants",132]
["Bee By-Products",375]
["Bees, Honey",374]
["Bees, Leaf Cutter",312]
["Beets",162]
["Bison",350]
["Blackberries",66]
["Blueberries",67]
["Bok Choi",163]
["Borage",6]
["Broccoflower",164]
["Broccoli",165]
["Brussels Sprouts",166]
["Buckwheat",7]
["Cabbage",167]
["Camelina",282]
["CAN Food Inspection Agency (CFIA) Payment for Non-Allowable commodities",587]
["Canadian Agricultural Skills Service (CASS)",561]
["Canadian Wheat Board Payments",2]
["Canary Seed",8]
["Cannabis",382]
["Canola",10]
["Cantaloupe",168]
["Caraway Seed",103]
["Carrots",169]
["Cattle, Calves",719]
["Cattle, Cows and Bulls",706]
["Cattle, Custom Feedlot Operator Income (Itemized) - Other feed charges",576]
["Cattle, Custom Feedlot Operator Income (Itemized) - Qualifying Feed",243]
["Cattle, Custom Feedlot Operator Income (Non Itemized) - Qualifying Feed",246]
["Cattle, Fat / Slaughter",720]
["Cattle, Feeder",721]
["Cattle, Livestock Owners Custom Feeding Expense (Itemized) - Other",572]
["Cattle, Livestock Owners Custom Feeding Expense (Itemized) - Qualifying Feed and Protein Supplements",577]
["Cattle, Livestock Owners Custom Feeding Expense (Non Itemized)",573]
{"$rows_left_out":245}