{"text_format":"1","workbook":"xlsx","n_sheets":7,"sheets":["Notes","MDI Calculator","MDI Calculator (data)","Lookup Tables (data)","Weather Stations (data)","MDI Farmer Rates (data)","Properties (data)"],"not_rendered":{"charts":0,"images":3,"macros":1,"external_links":0,"defined_names":34,"comments":0,"pivot_tables":0},"unopened":[],"bounds":{"document_bytes":16777216,"sheet_cells":100000,"rows_first":2000,"rows_last":500,"rows_between":2000,"halvings":0,"cell_chars":16384,"cell_head_chars":4096},"cells_cut":0,"cells_raw":0,"read":"whole","date_system":"1900"}

{"sheet":"Notes","index":0,"n_rows":4,"n_cols":10,"rows_kept":4,"cut":false,"hidden":false,"merged":[[0,1,0,10],[1,1,1,10],[2,9,3,10]]}
[null,"Moisture Deficiency Insurance (MDI)  Coverage and Premium Calculator"]
[]
[null,null,null,null,null,null,null,null,null,{"$f":"Crop_Year","v":2024}]
[null,null,null,null,null,null,null,null,"Crop Year"]

{"sheet":"MDI Calculator","index":1,"n_rows":35,"n_cols":14,"rows_kept":35,"cut":false,"hidden":false,"merged":[[34,2,36,12],[0,1,0,14],[10,9,10,13],[18,9,18,12],[2,2,2,4],[4,2,4,4],[6,2,6,4],[11,2,11,4],[18,2,18,3],[16,16377,17,16381],[25,9,25,10],[27,9,27,12],[27,2,27,4],[25,11,25,12],[16,9,17,12],[25,2,25,5]]}
[null,{"$f":"\"Moisture Deficiency Insurance  (MDI) Coverage and Premium Calculator \" & Crop_Year","v":"Moisture Deficiency Insurance  (MDI) Coverage and Premium Calculator 2024"}]
[]
[null,null,"Select Pasture Risk Area"]
[]
[null,null,"Select Type of Pasture"]
[]
[null,null,"Select Weather Station(s)"]
[]
[]
[]
[null,null,null,null,null,null,null,null,null,"Price Option"]
[null,null,"Insurance Coverage lb/ac",null,null,null,{"$f":"IF(ISERROR(HLOOKUP('MDI Calculator (data)'!Q29,'MDI Calculator (data)'!V4:Z39,'MDI Calculator (data)'!O3,FALSE)*0.8),\"\",HLOOKUP('MDI Calculator (data)'!Q29,'MDI Calculator (data)'!V4:Z39,'MDI Calculator (data)'!O3,FALSE)*0.8)","v":""},null,null,{"$f":"LOW_PRICE_OPTION*2000","v":150},"/Ton",null,{"$f":"HIGH_PRICE_OPTION*2000","v":194},"/Ton"]
[null,null,null,null,null,null,null,null,null,{"$f":"LOW_PRICE_OPTION","v":7.4999999999999997E-2},"/Lbs",null,{"$f":"HIGH_PRICE_OPTION","v":9.7000000000000003E-2},"/Lbs"]
[]
[null,null,null,null,null,null,null,null,null,{"$f":"IF(ISBLANK(G12),\"\",IFERROR($G$12*J13,\"\"))","v":""},null,null,{"$f":"IF(ISBLANK(G12),\"\",IFERROR($G$12*M13,\"\"))","v":""}]
[null,null,null,null,null,null,null,null,null,"\nLiability/Acre"]
[null,null,null,null,null,null,null,null,null,"Dollars Insured\nLiability/Acre"]
[null,null,null,null,"Weighting"]
[null,null,"Option",null,"M/J/J/A",null,null,null,null,"Premium $/Acre"]
[null,null,"A",{"$f":"'MDI Calculator (data)'!O13","v":"Short"},{"$f":"VLOOKUP(C20,'MDI Calculator (data)'!S24:T27,2,FALSE)","v":"40/40/20/00"},null,null,null,null,{"$f":"IFERROR($J$15*'MDI Calculator (data)'!Q23*0.01,\"\")","v":""},null,null,{"$f":"IFERROR($M$15*'MDI Calculator (data)'!Q23*0.01,\"\")","v":""}]
{"$rows_left_out":16}
{"sheet":"MDI Calculator (data)","index":2,"n_rows":300,"n_cols":53,"rows_kept":300,"cut":false,"hidden":true,"merged":[[0,1,0,9],[35,7,35,9]]}
[null,null,null,null,null,null,null,null,null,null,null,null,null,null,null,null,null,null,null,null,null,{"$f":"\"MDI Normals \" & Crop_Year","v":"MDI Normals 2024"}]
[null,null,null,null,"Weighting",null,null,null,null,null,null,null,null,null,null,null,null,null,null,null,null,{"$f":"R29","v":"Pasture Native"},{"$f":"R30","v":"Pasture Improved"},{"$f":"R31","v":"Bush 61-70%"},{"$f":"R32","v":"Bush 71-80%"},{"$f":"R33","v":"Bush 81+%"}]
[null,null,null,"A-OLD",30,30,20,20,0,null,null,null,null,null,1,{"$f":"FRA_link-1","v":0},"<FRA link",null,null,null,"FRA"]
[null,null,null,"B-OLD",20,30,30,20,0,null,null,null,null,null,null,null,null,null,null,null,null,1,2,3,4,5,null,null,null,null,"Modification History","Updated by","Description of Update","Status"]
[null,null,null,"C-OLD",20,20,20,20,20,null,null,null,null,null,null,null,null,null,null,null,1,876,1260,657,438,219,null,null,null,null,"2020-11-19","Martine West","Verified correct weather stations are displaying","Completed"]
[null,null,null,"D-OLD",10,20,30,30,10,null,null,null,null,null,null,null,null,null,null,null,2,480,703,360,240,120,null,null,null,null,"2023-01-08","J. Baumgartner","Updated the MIDI mornals."]
[null,null,null,"E-OLD",0,40,40,20,0,null,null,null,null,null,null,2,"Split",null,null,null,3,696,874,522,348,174]
[null,null,null,"F-OLD",0,40,30,30,0,null,null,null,null,null,null,null,null,null,null,null,4,876,1260,657,438,219]
[null,null,null,"G-OLD",0,30,30,20,20,null,null,null,null,null,null,null,null,null,null,null,5,1123,1361,842,562,281]
[null,null,null,"H-OLD",0,25,25,25,25,null,null,null,null,null,null,null,null,null,null,null,6,480,703,360,240,120]
[null,null,null,"I-OLD",30,30,20,20,0,null,null,null,null,null,null,null,null,null,null,null,7,480,703,360,240,120]
[null,null,null,"J-OLD",20,30,30,20,0,null,null,null,null,null,null,null,null,null,"A-OLD","30/30/20/20/00",8,480,703,360,240,120]
[null,null,null,"K-OLD",20,20,20,20,20,null,null,null,null,null,"Short",null,null,null,"B-OLD","20/30/30/20/00",9,480,703,360,240,120]
[null,null,null,"L-OLD",10,20,30,30,10,null,null,null,null,null,"Short",null,null,null,"C-OLD","20/20/20/20/20",10,696,874,522,348,174]
[null,null,null,"A",0,40,40,20,0,null,null,null,null,null,"Long",null,null,null,"D-OLD","10/20/30/30/10",11,876,1260,657,438,219]
[null,null,null,"B",0,40,30,30,0,null,null,null,null,null,"Long",null,null,null,"E-OLD","00/40/40/20/00",12,1123,1361,842,562,281]
[null,null,null,"C",0,30,30,20,20,null,null,null,null,null,null,null,null,null,"F-OLD","00/40/30/30/00",13,696,874,522,348,174]
[null,null,null,"D",0,25,25,25,25,null,null,null,null,null,null,null,null,null,"G-OLD","00/30/30/20/20",14,696,874,522,348,174]
[null,null,"Full % of normal","S1 % of normal","S2  % of normal","Payrate","S1","S2",{"$f":"'MDI Calculator'!J15","v":""},{"$f":"'MDI Calculator'!M15","v":""},null,null,{"$f":"VLOOKUP($P$35,Rate,$O$35-18,FALSE)","v":{"$error":"#N/A"}},null,null,null,null,null,"H-OLD","00/25/25/25/25",15,696,874,522,348,174]
[null,"A-OLD",{"$f":"(80*E3+M_100*F3+J_70*G3+J_30*H3+A_30*I3)*0.0001","v":0.24000000000000002},null,null,{"$f":"VLOOKUP(C20,MDI_full_lookup_table,2)","v":100},null,null,{"$f":"$I$19*F20*0.01","v":{"$error":"#VALUE!"}},{"$f":"$J$19*F20*0.01","v":{"$error":"#VALUE!"}},null,null,null,null,null,null,null,null,"I-OLD","30/30/20/20/00",16,696,874,522,348,174]
{"$rows_left_out":281}
{"sheet":"Lookup Tables (data)","index":3,"n_rows":56,"n_cols":17,"rows_kept":56,"cut":false,"hidden":true,"merged":[[0,0,0,4],[0,6,0,10],[2,0,2,1],[2,3,2,4],[2,6,2,7],[2,9,2,10],[1,3,1,4],[1,0,1,1],[1,6,1,7],[1,9,1,10]]}
["SAT Lookup Table",null,null,null,null,null,"MDI Lookup Table"]
["FULL",null,null,"SPLIT",null,null,"FULL",null,null,"SPLIT"]
["lookup table @ 90",null,null,"lookup table @ 85",null,null,"lookup table @80",null,null,"lookup table @70",null,null,null,"Modification History","Updated by","Description of Update","Status"]
[0.1,100,null,0.1,100,null,0.05,100,null,0.05,100,null,null,"2022-12-01","M West","Hid SAT columns","Completed"]
[0.5,100,null,0.45,100,null,0.3,100,null,0.2,100,null,null,"2023-01-19","M West","Added 2023 data","Completed"]
[0.51,97.5,null,0.46,97.5,null,0.31,100,null,0.21,100]
[0.52,95,null,0.47,95,null,0.32,100,null,0.22,100]
[0.53,92.5,null,0.48,92.5,null,0.33,100,null,0.23,100]
[0.54,90,null,0.49,90,null,0.34,100,null,0.24,100]
[0.55000000000000004,87.5,null,0.5,87.5,null,0.35,100,null,0.25,100]
[0.56000000000000005,85,null,0.51,85,null,0.36,100,null,0.26,100]
[0.56999999999999995,82.5,null,0.52,82.5,null,0.37,100,null,0.27,95]
[0.57999999999999996,80,null,0.53,80,null,0.38,100,null,0.28000000000000003,95]
[0.59,77.5,null,0.54,77.5,null,0.39,100,null,0.28999999999999998,90]
[0.6,75,null,0.55000000000000004,75,null,0.4,100,null,0.3,90]
[0.61,72.5,null,0.56000000000000005,72.5,null,0.41,100,null,0.31,85]
[0.62,70,null,0.56999999999999995,70,null,0.42,95,null,0.32,85]
[0.63,67.5,null,0.57999999999999996,67.5,null,0.43,95,null,0.33,80]
[0.64,65,null,0.59,65,null,0.44,90,null,0.34,80]
[0.65,62.5,null,0.6,62.5,null,0.45,90,null,0.35,75]
{"$rows_left_out":37}
{"sheet":"Weather Stations (data)","index":4,"n_rows":262,"n_cols":45,"rows_kept":262,"cut":false,"hidden":true,"merged":[]}
[null,null,null,null,null,null,"Forage Risk Area",null,null,null,null,null,null,null,null,null,null,null,null,null,null,null,null,null,null,null,null,null,null,null,null,null,null,null,null,null,null,null,"DropDownList"]
[]
["RISK_AREA_ID","RISK_AREA",1,2,3,4,5,6,7,8,9,10,11,12,13,14,15,16,17,18,19,20,21,22,23,24,25,26,27,28,29,30,31,32,33,34,35,null,null,null,null,"Modification History","Updated by","Description of Update","Status"]
[90,"Abee","Bow Island South","Barnwell","Ardenville","Ardenville","Ardenville","Acadia Valley","Acadia Valley","Atlee","Atlee","Ardenville","Ardenville","Azure","Acadia Valley","Alliance","Alliance","Alliance","Azure","Battle River","Battle River","Albert Hall","Albert Hall","Alliance","Barrhead","Barrhead","Barrhead","Abee","Abee","Abee","Abee","Athabasca","Ballater","Ballater","Ballater","Ballater","Brownvale",null,{"$f":"B4","v":"Abee"},null,null,"2020-11-19","Martine West","Updated weather stations & forage risk areas","Completed"]
[204,"Acadia Valley","Bullsprings","Bow Island South","Barnwell","Barnwell","Barons","Atlee","Atlee","Barnwell","Bassano","Azure","Azure","Barons","Alliance","Bellshill","Bassano","Azure","Beiseker","Beiseker","Breton","Alliance","Alliance","Andrew","Battle River","Battle River","Breton","Albert Hall","Andrew","Andrew","Andrew","Ballater","Brownvale","Beaverlodge","Beaverlodge","Beaverlodge","Cleardale",null,{"$f":"B5","v":"Acadia Valley"},null,null,"2022-01-10","Martine West","Update new weather stations & Pibroch spelling","Completed"]
[304,"Aden","Comrey","Brooks","Barons","Barons","Brocket","Barnwell","Bassano","Barons","Beiseker","Barnwell","Barons","Beiseker","Bassano","Big Valley","Beiseker","Bassano","Big Valley","Big Valley","Crestomere","Beiseker","Bellshill","Battle River","Breton","Breton","Campsie","Andrew","Athabasca","Athabasca","Athabasca","Barrhead","Chisholm","Brownvale","Brownvale","Brownvale","Deadwood",null,"Aden",null,null,"2022-12-22","Martine West","Extracted Risk areas from Envoy","Completed"]
[160,"Albert Hall","Etzikom","BTAP","Blackie","Brocket","BTAP","Bow Island South","Bodo","Bassano","Blackie","Barons","Beiseker","Black Diamond","Big Valley","Bodo","Big Valley","Beiseker","Black Diamond","Breton","Dickson Dam","Bellshill","Big Valley","Beiseker","Busby","Busby","Carrot Creek","Beaverdam","Atmore","Barrhead","Atmore","Campsie","Deadwood","Eaglesham","Cleardale","Cleardale","Eureka River",null,"Albert Hall",null,null,"2024-01-24","Jesse Trottier","Fixed sorting for the weather stations","Completed"]
[151,"Alliance","Foremost","Bullsprings","Bow Island South","BTAP","Bullhorn Coulee Reservoir Inlet","Brooks","Brooks","Blackie","Brooks","Bassano","Black Diamond","Blackie","Bodo","Cadogan","Cabin Lake","Big Valley","Blackie","Calgary","Divide Hills","Big Valley","Camrose","Big Valley","Campsie","Campsie","Edson","Camrose","Beaverdam","Battle River","Barrhead","Chisholm","Duck Lake","Eureka River","Deadwood","Deadwood","Fairview",null,"Alliance"]
[91,"Andrew","Irvine","Comrey","Brocket","Bullhorn Coulee Reservoir Inlet","Bullhorn Headwater","Buffalo","Buffalo","Bow Island South","Cabin Lake","Beiseker","Blackie","Calgary","Cabin Lake","Consort","Calgary","Black Diamond","Calgary","Camrose","Edmonton","Bodo","Craigmyle","Breton","Camrose","Carrot Creek","Evansburg2","Dewberry","Busby","Breton","Busby","Duck Lake","Eaglesham","Fairview","Eaglesham","Eaglesham","Ft Vermilion",null,"Andrew"]
[259,"Ardenville","Ketchum Creek","Enchant","Brooks","Bullhorn Headwater","Cardston","Bullsprings","Bullsprings","Brooks","Champion","Big Valley","Brocket","Champion","Cadogan","Coronation","Coronation","Blackie","Craigmyle","Crestomere","Edson","Cadogan","Crestomere","Camrose","Crestomere","Crestomere","Ft Assiniboine","Dupre","Dewberry","Busby","Campsie","Ft Assiniboine","Hazel","High Level","Eureka River","Eureka River","Hawk Hills",null,"Ardenville"]
[161,"Athabasca","Lodge Creek","Etzikom","BTAP","Cardston","Carway","Cabin Lake","Cabin Lake","BTAP","Craigmyle","Black Diamond","BTAP","Claresholm","Cereal","Craigmyle","Craigmyle","Calgary","Delburne","Delburne","Evansburg2","Consort","Delburne","Craigmyle","Delburne","Edmonton","Glenevis","Edmonton","Dupre","Campsie","Chisholm","High Prairie","High Level","High Prairie","Fairview","Fairview","Hazel",null,"Athabasca"]
[203,"Atlee","Manyberries","Fincastle","Bullhorn Coulee Reservoir Inlet","Carway","Claresholm","Cappon","Cadogan","Buffalo","Drumheller","Blackie","Calgary","Elbow","Consort","Delburne","Delburne","Champion","Dickson Dam","Dickson Dam","Hespero","Coronation","Divide Hills","Crestomere","Dickson Dam","Edson","Greencourt","Elk Island Park","Edmonton","Camrose","Duck Lake","High Prairie  Banana Belt","High Prairie","High Prairie  Banana Belt","Hazel","Hawk Hills","High Level",null,"Atlee"]
[92,"Atmore","Medicine Hat","Foremost","Bullhorn Headwater","Champion","Cross Drain 5","Cereal","Cappon","Bullsprings","Enchant","Brocket","Champion","Keoma","Coronation","Divide Hills","Divide Hills","Craigmyle","Divide Hills","Divide Hills","Lacombe","Craigmyle","Drumheller","Delburne","Divide Hills","Evansburg2","Little Paddle Headwaters","Ferintosh","Elk Island Park","Duck Lake","Elk Island Park","Little Paddle Headwaters","High Prairie  Banana Belt","Hines Creek","High Level","Hazel","Hines Creek",null,"Atmore"]
[202,"Azure","Medicine Lodge","Grassy Lake","Cardston","Claresholm","Del Bonita","Etzikom","Cereal","Cabin Lake","Finnegan","BTAP","Claresholm","Linden","Craigmyle","Drumheller","Drumheller","Crestomere","Drumheller","Elbow","Leedale","Delburne","Edgerton","Dickson Dam","Edmonton","Ft Assiniboine","Mayerthorpe","Forestburg","Holden","Edmonton","Evansburg2","Mayerthorpe","Jean Cote","Jean Cote","High Prairie","High Level","Jean Cote",null,"Azure"]
[46,"Ballater","Onefour","Irvine","Carway","Cross Drain 5","Fort Macleod","Fincastle","Consort","Cappon","Gleichen","Bullhorn Coulee Reservoir Inlet","Elbow","Livingston","Drumheller","Edgerton","Finnegan","Delburne","Elbow","Ferintosh","Linden","Divide Hills","Edmonton","Divide Hills","Elk Island Park","Glenevis","Paddle Dam","Gladstone","Hoselaw","Elk Island Park","Ft Assiniboine","Paddle Dam","Manning","La Glace","Hines Creek","Hines Creek","Keg River",null,"Ballater"]
[54,"Barnwell","Pakowki Lake","Ketchum Creek","Champion","Del Bonita","Lee Creek","Finnegan","Coronation","Champion","Hand Hills","Bullhorn Headwater","Fort Macleod","Mossleigh","Esther","Esther","Fleet","Dickson Dam","Gleichen","Hespero","Magee Lake","Drumheller","Elk Island Park","Edmonton","Evansburg2","Greencourt","Rocky Mnt H","Greencourt","Kinikinik","Evansburg2","Glenevis","Peavine","Peavine","Peavine","Jean Cote","Jean Cote","La Crete",null,"Barnwell"]
[146,"Barons","Pinhorn","Lathom","Claresholm","Enchant","Livingston","Foremost","Craigmyle","Claresholm","Hussar","Calgary","Gleichen","Neir","Finnegan","Fleet","Forestburg","Drumheller","Hespero","Keoma","Neir","Edgerton","Ferintosh","Elk Island Park","Ferintosh","Lacombe","Tomahawk","Holden","Kitscoty","Ferintosh","Greencourt","Pibroch","Pleasant View","Peoria","La Glace","La Glace","Manning",null,"Barons"]
[249,"Barrhead","Ralston","Lethbridge","Cross Drain 5","Fincastle","Milk River Ridge","Grassy Lake","Drumheller","Enchant","Keoma","Cardston","Keoma","Olds","Fleet","Forestburg","Gleichen","Elbow","Keoma","Lacombe","Olds","Esther","Fleet","Ferintosh","Glenevis","Leedale","Twin Lakes","Hoselaw","Lac La Biche","Ft Assiniboine","Kinikinik","Slave Lake","Roma","Roma","Manning","Manning","Rocky Lane",null,"Barrhead"]
[147,"Bassano","Rush Lake","Lodge Creek","Del Bonita","Fort Macleod","Pincher Creek","Iddesleigh","Esther","Etzikom","Lathom","Champion","Livingston","Pine Coulee FP","Forestburg","Gooseberry Lake","Halkirk","Ferintosh","Lacombe","Leedale","Prentiss","Fleet","Forestburg","Fleet","Hespero","Little Paddle Headwaters","Whitecourt","Killam","Legal","Gladstone","Lac La Biche","Spring Creek","Slave Lake","Rycroft","Peavine","Peoria","Roma",null,"Bassano"]
[132,"Battle River","Sage Creek","Manyberries","Enchant","Lee Creek","Pine Coulee FP","Irvine","Finnegan","Fincastle","Linden","Claresholm","Mossleigh","Porcupine","Gleichen","Halkirk","Hand Hills","Fleet","Linden","Linden","Red Deer","Forestburg","Gilt Edge North","Forestburg","Holden","Magee Lake","","Kitscoty","Lindbergh","Glenevis","Legal","Twin Lakes","Three Creeks","Savanna","Peoria","Roma","Savanna",null,"Battle River"]
{"$rows_left_out":243}
{"sheet":"MDI Farmer Rates (data)","index":5,"n_rows":261,"n_cols":12,"rows_kept":261,"cut":false,"hidden":true,"merged":[]}
["risk_area","A","B","C","D",null,null,null,"Note: Check to unsure the Rate named range is still valid after update."]
["Abee",9.41,9.0299999999999994,6.98,6.79,null,null,null,"Modification History","Updated by","Description of Update","Status"]
["Acadia Valley",9.85,10.62,9.2799999999999994,9.64,null,null,null,"2020-01-14","Martine West","Data extracted from Envoy","Completed"]
["Aden",19.36,21.84,23.29,25.54,null,null,null,"2021-01-19","Martine West","Updated Risk Areas","Completed"]
["Albert Hall",9.85,9.76,7.51,7.37,null,null,null,"2021-01-20","Martine West","Updated data for Ras","Completed"]
["Alliance",9.16,9.2200000000000006,7.16,7.27,null,null,null,"2022-01-19","Martine West","Updated data","Completed"]
["Andrew",9.41,9.0299999999999994,6.98,6.79,null,null,null,"2023-01-23","Jim Baumgartner","Updated data","Completed"]
["Ardenville",10.55,11.3,9.6199999999999992,10.26,null,null,null,"2024-01-26","Jesse Trottier","Updated Marwayne station","Completed"]
["Athabasca",9.41,9.0299999999999994,6.98,6.79]
["Atlee",9.85,10.62,9.2799999999999994,9.64]
["Atmore",9.41,9.0299999999999994,6.98,6.79]
["Azure",7.34,8.42,7.14,7.53]
["BTAP",10.55,11.3,9.6199999999999992,10.26]
["Ballater",9.75,9.8000000000000007,8.42,8.34]
["Barnwell",10.55,11.3,9.6199999999999992,10.26]
["Barons",9.85,10.62,9.2799999999999994,9.64]
["Barrhead",9.41,9.0299999999999994,6.98,6.79]
["Bassano",9.85,10.62,9.2799999999999994,9.64]
["Battle River",6.48,6.48,5.13,5.14]
["Beaverdam",9.41,9.0299999999999994,6.98,6.79]
{"$rows_left_out":242}
{"sheet":"Properties (data)","index":6,"n_rows":10,"n_cols":15,"rows_kept":10,"cut":false,"hidden":true,"merged":[]}
[null,"Common Data","Local Properties"]
["Property","Value","Property","Value",null,null,null,null,null,null,null,"Modification History","Updated by","Description of Update","Status"]
["Hail Factor",null,"Crop Year",2024,null,null,null,null,null,null,null,"2020-11-19","Martine West","Updated year, powerusers","Completed"]
["ReplyEmailAddress","Info@afsc.ca","PowerUsers","<bnewman><mbarefoot>",null,null,null,null,null,null,null,"2021-01-21","Martine West","Options extracted from TING4 ","Completed"]
["LogoFile","CAP AFSC AB CAN bw.jpg",null,null,null,null,null,null,null,null,null,"2022-12-01","Martine West","Removed SAT from calc name","Completed"]
["DataFilePath1","\\\\hs-teams.afsc.ca@SSL\\DavWWWRoot\\pnp\\pnp\\Calculators\\","LOW PRICE OPTION",7.4999999999999997E-2,null,null,null,null,null,null,null,"2023-01-25","Jim Baumgartner","Updated Price Options."]
["DataFilePath2","\\\\homestead.afsc.ca@SSL\\DavWWWRoot\\wrkres\\Documents","HIGH PRICE OPTION",9.7000000000000003E-2,null,null,null,null,null,null,null,"2023-12-06","Jim Baumgartner","Updated Crop Year to 2024"]
["CommonDataFile","ManualCalcCommonData",null,null,null,null,null,null,null,null,null,"2024-01-08","Jim Baumgartner","Update the Low and High Price Options."]
["ModulePath","\\\\hs-teams.afsc.ca@SSL\\DavWWWRoot\\pnp\\pnp\\Calculators\\","MDI_Cov_Prem_Calc"]
["ModuleName","CalculatorMacros.code"]