{"text_format":"1","workbook":"xlsx","n_sheets":8,"sheets":["St. Hail Calculator","Address (data)","St. Hail Commodities (data)","Hail rates (data)","Not Eligible (data)","Twp Rge Mer (data)","Offices (data)","Properties (Data)"],"not_rendered":{"charts":0,"images":4,"macros":1,"external_links":0,"defined_names":33,"comments":0,"pivot_tables":0},"unopened":[],"bounds":{"document_bytes":16777216,"sheet_cells":100000,"rows_first":2000,"rows_last":500,"rows_between":2000,"halvings":0,"cell_chars":16384,"cell_head_chars":4096},"cells_cut":0,"cells_raw":0,"read":"whole","date_system":"1900"}

{"sheet":"St. Hail Calculator","index":0,"n_rows":36,"n_cols":24,"rows_kept":36,"cut":false,"hidden":false,"merged":[[0,1,0,15],[2,14,3,15],[5,14,5,15],[4,9,4,10],[4,11,4,12],[14,22,15,22],[14,23,15,23],[34,2,34,15],[27,3,27,4],[28,3,28,4],[30,3,30,4],[32,2,32,5],[33,2,33,11],[15,15,16,15],[15,14,16,14],[15,13,16,13],[15,11,16,11],[15,12,16,12],[15,6,16,6],[15,1,15,3],[15,5,16,5],[8,1,8,6],[5,7,5,8],[14,20,15,20],[14,21,15,21],[12,5,12,6],[13,5,13,6],[13,7,13,8],[15,7,16,7],[12,7,12,8],[15,4,16,4],[15,8,16,8],[15,9,16,9],[15,10,16,10],[6,1,6,6],[7,1,7,6]]}
[null,"Straight Hail Calculator",null,null,null,null,null,null,null,null,null,null,null,null,null,null,null,"Hide here and after"]
[]
[null,null,null,null,null,null,null,null,null,null,null,null,null,null,{"$f":"CropYear","v":2023}]
[null,null,null,null,null,null,null,"AFSC Office Information",null,null,null,null,null,"Crop Year:"]
[null,null,null,null,null,null,null,"Branch Office:"]
[null,null,null,null,null,null,null,{"$f":"'Address (data)'!B3","v":""},null,null,null,null,null,"Date:","2023-04-17"]
[null,{"$f":"'Address (data)'!A6","v":"Client Name"},null,null,null,null,null,{"$f":"IF('Address (data)'!C3=0,'Address (data)'!D3 & \" \" & 'Address (data)'!E3,'Address (data)'!C3)","v":""},null,null,null,null,null,null,null,null,null,null,"Client Name"]
[null,{"$f":"'Address (data)'!A7","v":"Client Address"},null,null,null,null,null,{"$f":"IF('Address (data)'!C3=0,\"\",'Address (data)'!D3&\" \" &'Address (data)'!E3)","v":" "},null,null,null,null,null,null,null,null,null,null,"Client Address"]
[null,{"$f":"'Address (data)'!A8","v":"City, AB  Postal Code"},null,null,null,null,null,"Phone:",{"$f":"'Address (data)'!F3","v":""},null,{"$f":"'Address (data)'!E3","v":""},null,null,null,null,null,null,null,"City, AB  Postal Code"]
[null,"`",null,null,null,null,null,"Fax:",{"$f":"'Address (data)'!G3","v":""},null,{"$f":"'Address (data)'!F3","v":""}]
[]
[]
[null,null,null,null,null,"AFSC ID",null,"Subscription"]
[null,null,null,null,null,null,null,null,null,"<hide>","<hide>",null,null,null,null,null,null,null,null,null,"Modication History"]
[null,null,null,null,null,null,null,null,null,null,null,null,null,null,null,null,null,null,null,null,"2020-03-20","Martine West","No changes for 2020 other than year","Completed"]
[null,"Land Location",null,null,"Agricultural Product","Irrigated or Dryland","Acres","Coverage ($Acre)","Deductible\nFull Coverage, 10% or 25%","hide\nMax $ Coverage","\nhide Full Coverage","Actual Coverage","Twp Hail Rate","Crop Rate Factor","Final Hail Rate","Premium"]
[null,"Twp","Rge","Mer",null,null,null,null,null,null,null,null,null,null,null,null,null,"LOOKUP","Deductible",null,"2020-04-24","Martine West","Updated Commodities","Completed"]
[null,null,null,null,null,null,null,null,null,{"$f":"IF(ISNA(VLOOKUP(CONCATENATE(E18,F18),croptype,2,FALSE)),\"\",VLOOKUP(CONCATENATE(E18,F18),croptype,4,FALSE))","v":""},{"$f":"IF(ISBLANK(E18),\"\",G18*H18)","v":""},{"$f":"IF(OR(ISBLANK(F18),ISBLANK(I18),ISBLANK(G18),ISBLANK(J18)),\"\",IF(H18>J18,\"Maximum Dollar Coverage for \"&E18&\" is $\"&J18,IF(I18=\"Full coverage\",G18*H18,G18*H18*(1-I18))))","v":""},{"$f":"IF(AND(ISBLANK(B18),ISBLANK(C18),ISBLANK(D18)),\"\",IF(ISNA(VLOOKUP(R18,Hail_Rates,5,FALSE)),\"Invalid Location\",VLOOKUP(R18,Hail_Rates,5,FALSE)))","v":""},{"$f":"IF(ISBLANK(E18),\"\",VLOOKUP(E18,Crop,3,FALSE))","v":""},{"$f":"IF(ISBLANK(E18),\"\",IF(ISTEXT(L18),0,(IF(S18=1,M18*N18,IF(S18=2,(M18*N18)*deductiblepercentfor10,(M18*N18)*deductiblepercentfor25)))))","v":""},{"$f":"IF(ISTEXT(L18),\"\",ROUND(K18*O18,2))","v":""},{"$f":"IF(P18=\"\",\"\",1)","v":""},{"$f":"(B18*100000)+(C18*100)+D18","v":0},{"$f":"IF(R18=0,0,IF(I18='St. Hail Commodities (data)'!$G$12,1,IF(I18='St. Hail Commodities (data)'!$G$13,2,3)))","v":0},{"$f":"CalcDeductible(I18)","v":{"$error":"#NAME?"}}]
[null,null,null,null,null,null,null,null,null,"",{"$f":"IF(ISBLANK(E19),\"\",G19*H19)","v":""},{"$f":"IF(OR(ISBLANK(F19),ISBLANK(I19),ISBLANK(G19),ISBLANK(J19)),\"\",IF(H19>J19,\"Maximum Dollar Coverage for \"&E19&\" is $\"&J19,IF(I19=\"Full coverage\",G19*H19,G19*H19*(1-I19))))","v":""},{"$f":"IF(AND(ISBLANK(B19),ISBLANK(C19),ISBLANK(D19)),\"\",IF(ISNA(VLOOKUP(R19,Hail_Rates,5,FALSE)),\"Invalid Location\",VLOOKUP(R19,Hail_Rates,5,FALSE)))","v":""},"","",{"$f":"IF(ISTEXT(L19),\"\",ROUND(K19*O19,2))","v":""},"",{"$f":"(B19*100000)+(C19*100)+D19","v":0},{"$f":"IF(R19=0,0,IF(I19='St. Hail Commodities (data)'!$G$12,1,IF(I19='St. Hail Commodities (data)'!$G$13,2,3)))","v":0},{"$f":"CalcDeductible(I19)","v":{"$error":"#NAME?"}}]
[null,null,null,null,null,null,null,null,null,"","","","","","","",{"$f":"IF(P20=\"\",\"\",1)","v":""},0,{"$f":"IF(R20=0,0,IF(I20='St. Hail Commodities (data)'!$G$12,1,IF(I20='St. Hail Commodities (data)'!$G$13,2,3)))","v":0},{"$f":"CalcDeductible(I20)","v":{"$error":"#NAME?"}}]
[null,null,null,null,null,null,null,null,null,{"$f":"IF(ISNA(VLOOKUP(CONCATENATE(E21,F21),croptype,2,FALSE)),\"\",VLOOKUP(CONCATENATE(E21,F21),croptype,4,FALSE))","v":""},"","","","","","","",0,{"$f":"IF(R21=0,0,IF(I21='St. Hail Commodities (data)'!$G$12,1,IF(I21='St. Hail Commodities (data)'!$G$13,2,3)))","v":0},{"$f":"CalcDeductible(I21)","v":{"$error":"#NAME?"}}]
[null,null,null,null,null,null,null,null,null,"","","","","","","","",0,{"$f":"IF(R22=0,0,IF(I22='St. Hail Commodities (data)'!$G$12,1,IF(I22='St. Hail Commodities (data)'!$G$13,2,3)))","v":0},{"$f":"CalcDeductible(I22)","v":{"$error":"#NAME?"}}]
[null,null,null,null,null,null,null,null,null,"","","","","","","","",0,{"$f":"IF(R23=0,0,IF(I23='St. Hail Commodities (data)'!$G$12,1,IF(I23='St. Hail Commodities (data)'!$G$13,2,3)))","v":0},{"$f":"CalcDeductible(I23)","v":{"$error":"#NAME?"}}]
[null,null,null,null,null,null,null,null,null,"","","","","","","","",0,{"$f":"IF(R24=0,0,IF(I24='St. Hail Commodities (data)'!$G$12,1,IF(I24='St. Hail Commodities (data)'!$G$13,2,3)))","v":0},{"$f":"CalcDeductible(I24)","v":{"$error":"#NAME?"}}]
[null,null,null,null,null,null,null,null,null,"","","","","","","","",0,{"$f":"IF(R25=0,0,IF(I25='St. Hail Commodities (data)'!$G$12,1,IF(I25='St. Hail Commodities (data)'!$G$13,2,3)))","v":0},{"$f":"CalcDeductible(I25)","v":{"$error":"#NAME?"}}]
[null,null,null,null,null,null,null,null,null,"","","","","","","","",0,{"$f":"IF(R26=0,0,IF(I26='St. Hail Commodities (data)'!$G$12,1,IF(I26='St. Hail Commodities (data)'!$G$13,2,3)))","v":0},{"$f":"CalcDeductible(I26)","v":{"$error":"#NAME?"}}]
[null,null,null,null,null,null,null,null,null,"","","","","","","","",0,{"$f":"IF(R27=0,0,IF(I27='St. Hail Commodities (data)'!$G$12,1,IF(I27='St. Hail Commodities (data)'!$G$13,2,3)))","v":0},{"$f":"CalcDeductible(I27)","v":{"$error":"#NAME?"}}]
[null,null,null,"Subtotal",null,null,null,null,null,null,null,null,null,null,null,{"$f":"SUM(INDIRECT(\"P18:P\"&ROW()-1))","v":0}]
[null,null,null,"On-line Discount (2%)",null,null,null,null,null,null,null,null,null,null,null,{"$f":"ROUND(SUM(P28*0.02)*-1,2)","v":0}]
[null,null,null,"Early Payment Discount (2%)",null,null,null,null,null,null,null,null,null,null,null,{"$f":"ROUND(SUM(P28*0.02)*-1,2)","v":0}]
[null,null,null,"Total",null,null,{"$f":"SUM(INDIRECT(\"G16:G\"&ROW()-1))","v":0},null,null,null,null,null,null,null,null,{"$f":"(SUM(P28:P30))","v":0}]
[]
[null,null,"DISCLAIMER"]
[null,null,"This is an insurance estimate and is not confirmation that you have insurance. "]
[null,null,"Enhanced estimate options are available using your AFSC Connect online account. Log in to AFSC Connect to quickly populate your land and crop information from previous hail insurance and/or crop insurance.\nContact AFSC at 1.877.899.2372 or info@afsc.ca if you have any questions regarding Hail Insurance or AFSC Connect. \n\n"]
[null,"Hide here and after"]

{"sheet":"Address (data)","index":1,"n_rows":8,"n_cols":13,"rows_kept":8,"cut":false,"hidden":true,"merged":[]}
["Address Table"]
["Branch Office","Address Line 1","Address Line 2","City","Postal Code","Phone","Fax",null,null,"Modication History"]
[{"$f":"IF('St. Hail Calculator'!L5=\"\",\"\",VLOOKUP('St. Hail Calculator'!L5,BranchOffices,1,FALSE))","v":""},{"$f":"IF(A3=\"\",\"\",VLOOKUP('St. Hail Calculator'!L5,BranchOffices,2,FALSE))","v":""},{"$f":"IF('St. Hail Calculator'!L5=\"\",\"\",VLOOKUP('St. Hail Calculator'!L5,BranchOffices,3,FALSE))","v":""},{"$f":"IF('St. Hail Calculator'!L5=\"\",\"\",VLOOKUP('St. Hail Calculator'!L5,BranchOffices,4,FALSE))","v":""},{"$f":"IF('St. Hail Calculator'!L5=\"\",\"\",VLOOKUP('St. Hail Calculator'!L5,BranchOffices,5,FALSE))","v":""},{"$f":"IF('St. Hail Calculator'!L5=\"\",\"\",VLOOKUP('St. Hail Calculator'!L5,BranchOffices,6,FALSE))","v":""},{"$f":"IF('St. Hail Calculator'!L5=\"\",\"\",VLOOKUP('St. Hail Calculator'!L5,BranchOffices,7,FALSE))","v":""},null,null,"2020-03-20","Martine West","No changes for 2020","Completed"]
[null,null,null,null,null,null,null,null,null,"2021-03-18","Martine West","No changes for 2021","Completed"]
[]
["Client Name"]
["Client Address"]
["City, AB  Postal Code"]

{"sheet":"St. Hail Commodities (data)","index":2,"n_rows":99,"n_cols":16,"rows_kept":99,"cut":false,"hidden":true,"merged":[]}
["Crop","Ag_Input","Rate Factor",null,"Maximum"]
["Alfalfa Seed",{"$f":"A2&$G$8","v":"Alfalfa SeedDry"},1.5,null,325]
["Barley","BarleyDry",1,null,325,null,null,null,null,null,null,null,"Modification History"]
["Borage","BorageDry",1.5,null,2525,null,"Buckwheat",null," not eligible for irrigation coverage",null,null,null,"2020-03-20","Martine West","No changes for 2020","Completed"]
["Brome","BromeDry",1.5,null,325,null,"CamelinaIrrigated",null," not eligible for irrigation coverage",null,null,null,"2020-04-23","Jackie Sanden","Updated for 2020 crops","Completed"]
["Canary Seed","Canary SeedDry",1,null,325,null,null,null,null,null,null,null,"2021-03-18","M West","Split peas into two commodities","Completed"]
["Canola","CanolaDry",1.5,null,425,null,null,null,null,null,null,null,"2021-03-24","J Sanden","Update Ag Inputs 2021"]
["Cereal for Silage","Cereal for SilageDry",1,null,325,null,"Dry",null,null,null,null,null,"2021-04-19","M West","Updated Ag Inputs 2021","Completed"]
["Chickpeas","ChickpeasDry",1.5,null,425,null,"Irrigated",null,null,null,null,null,"2022-03-30","Jim B.","Updated Ag Inputs 2022","Completed"]
["Clover","CloverDry",1.5,null,325,null,null,null,null,null,null,null,"2023-02-15","Jim B.","Updated Ag Inputs 2023","Completed"]
["Coriander","CorianderDry",1.5,null,2525]
["Corn Silage","Corn SilageDry",0.75,null,325,1,"Full Coverage"]
["Corn-Grain, Grazing","Corn-Grain, GrazingDry",1,null,325,2,0.1,0.75,"As per I2304-0161"]
["Crested Wheat Grass","Crested Wheat GrassDry",1.5,null,325,3,0.25,0.5,"As per I2304-0161"]
["Dill","DillDry",1.5,null,2525]
["Dry Beans","Dry BeansDry",1.5,null,325]
["Faba Beans","Faba BeansDry",1.5,null,325]
["Fescue, Grass & Legume for Seed","Fescue, Grass & Legume for SeedDry",1.5,null,325]
["Field Peas","Field PeasDry",1.75,null,325]
["Flax","FlaxDry",1,null,325]
["Fresh Vegetables i.e. Sweet Corn - Pumpkin","Fresh Vegetables i.e. Sweet Corn - PumpkinDry",1.5,null,2525]
["Garlic","GarlicDry",1.5,null,2525]
["Hay","HayDry",0.75,null,325]
["Hay Silage","Hay SilageDry",0.75,null,325]
["Hemp","HempDry",1,null,325]
["Herbs & Spices","Herbs & SpicesDry",1.5,null,2525]
["Intercrop - Cereal","Intercrop - CerealDry",1,null,325]
["Intercrop - Oilseed","Intercrop - OilseedDry",1.75,null,325]
["Intercrop - Pulse","Intercrop - PulseDry",1.5,null,325]
["Lentils","LentilsDry",1.5,null,325]
["Market Garden","Market GardenDry",1.5,null,19050]
["Millet","MilletDry",1,null,325]
["Mint","MintDry",1,null,2525]
["Mixed Grain",{"$f":"A34&$G$8","v":"Mixed GrainDry"},1,null,325]
["Mustard","MustardDry",1.75,null,325]
["Oats","OatsDry",1,null,325]
["Oilseed for Silage","Oilseed for SilageDry",1.75,null,325]
["Other Oilseeds","Other OilseedsDry",1,null,325]
["Potatoes","PotatoesDry",1,null,3725]
["Processing Crops","Processing CropsDry",2,null,2525]
["Pulse for Silage","Pulse for SilageDry",1.5,null,325]
["Rye","RyeDry",1,null,325]
["Safflower","SafflowerDry",1,null,325]
["Sorghum Silage","Sorghum SilageDry",0.75,null,325]
["Soybeans","SoybeansDry",1.5,null,325]
["Spring Spelt","Spring SpeltDry",1,null,325]
["Sugar Beets","Sugar BeetsDry",0.75,null,2525]
["Sunflower","SunflowerDry",1,null,325]
["Triticale","TriticaleDry",1,null,325]
["Wheat","WheatDry",1,null,325]
["Alfalfa Seed",{"$f":"A51&$G$9","v":"Alfalfa SeedIrrigated"},1.5,null,575]
["Barley","BarleyIrrigated",1,null,575]
["Borage","BorageIrrigated",1.5,null,2900]
["Brome","BromeIrrigated",1.5,null,575]
["Canary Seed","Canary SeedIrrigated",1,null,575]
["Canola","CanolaIrrigated",1.5,null,575]
["Cereal for Silage","Cereal for SilageIrrigated",1,null,575]
["Chickpeas","ChickpeasIrrigated",1.5,null,575]
["Clover","CloverIrrigated",1.5,null,575]
["Coriander","CorianderIrrigated",1.5,null,2900]
{"$rows_left_out":40}
{"sheet":"Hail rates (data)","index":3,"n_rows":4241,"n_cols":17,"rows_kept":4241,"cut":false,"hidden":true,"merged":[]}
["location","Township","range","meridian","rate","silage"]
[{"$f":"(B2*100000)+(C2*100)+D2","v":100104},"1","1","4",0.06,{"$f":"E2*$K$5","v":4.4999999999999998E-2},null,null,null,null,null,null,null,"Modication History"]
[{"$f":"(B3*100000)+(C3*100)+D3","v":100105},"1","1","5",0.06,4.4999999999999998E-2,null,null,null,null,null,null,null,"2020-03-20","Martine West","Retrieved 2020 Hail Rates","Completed"]
[100204,"1","2","4",0.06,4.4999999999999998E-2,null,null,null,null,null,null,null,"2021-03-18","Martine West","Retrieved 2021 Hail Rates","Completed"]
[100205,"1","2","5",0.06,4.4999999999999998E-2,null,null,null,"Silage Rate",0.75,null,null,"2022-01-24","Martine West","Retrieved 2022 Hail Rates","Completed"]
[100304,"1","3","4",0.06,4.4999999999999998E-2,null,null,null,null,null,null,null,"2023-02-15","J Baumgartner","Retrieved 2022 Hail Rates","Completed"]
[100404,"1","4","4",0.06,4.4999999999999998E-2]
[100504,"1","5","4",0.06,4.4999999999999998E-2]
[100604,"1","6","4",0.06,4.4999999999999998E-2]
[100704,"1","7","4",0.06,4.4999999999999998E-2]
[100804,"1","8","4",7.0000000000000007E-2,5.2500000000000005E-2]
[100904,"1","9","4",7.0000000000000007E-2,5.2500000000000005E-2]
[101004,"1","10","4",7.0000000000000007E-2,5.2500000000000005E-2,null,null,"."]
[101104,"1","11","4",0.06,4.4999999999999998E-2]
[101204,"1","12","4",0.06,4.4999999999999998E-2]
[101304,"1","13","4",0.06,4.4999999999999998E-2]
[101404,"1","14","4",0.05,3.7500000000000006E-2]
[101504,"1","15","4",0.05,3.7500000000000006E-2]
[101604,"1","16","4",0.04,0.03]
[101704,"1","17","4",0.05,3.7500000000000006E-2]
[101804,"1","18","4",0.06,4.4999999999999998E-2]
[101904,"1","19","4",0.06,4.4999999999999998E-2]
[102004,"1","20","4",7.0000000000000007E-2,5.2500000000000005E-2]
[102104,"1","21","4",0.11,8.2500000000000004E-2]
[102204,"1","22","4",0.12,0.09]
[102304,"1","23","4",0.1,7.5000000000000011E-2]
[102404,"1","24","4",0.08,0.06]
[102504,"1","25","4",0.08,0.06]
[102604,"1","26","4",0.08,0.06]
[102704,"1","27","4",7.0000000000000007E-2,5.2500000000000005E-2]
[102803,"1","28","3",0.06,4.4999999999999998E-2]
[102804,"1","28","4",7.0000000000000007E-2,5.2500000000000005E-2]
[102903,"1","29","3",0.06,4.4999999999999998E-2]
[102904,"1","29","4",0.06,4.4999999999999998E-2]
[103003,"1","30","3",0.06,4.4999999999999998E-2]
[103004,"1","30","4",0.06,4.4999999999999998E-2]
[200104,"2","1","4",0.06,4.4999999999999998E-2]
[200105,"2","1","5",0.06,4.4999999999999998E-2]
[200204,"2","2","4",0.06,4.4999999999999998E-2]
[200205,"2","2","5",0.06,4.4999999999999998E-2]
[200304,"2","3","4",0.06,4.4999999999999998E-2]
[200404,"2","4","4",0.06,4.4999999999999998E-2]
[200504,"2","5","4",0.06,4.4999999999999998E-2]
[200604,"2","6","4",0.06,4.4999999999999998E-2]
[200704,"2","7","4",0.06,4.4999999999999998E-2]
[200804,"2","8","4",7.0000000000000007E-2,5.2500000000000005E-2]
[200904,"2","9","4",7.0000000000000007E-2,5.2500000000000005E-2]
[201004,"2","10","4",7.0000000000000007E-2,5.2500000000000005E-2]
[201104,"2","11","4",7.0000000000000007E-2,5.2500000000000005E-2]
[201204,"2","12","4",0.06,4.4999999999999998E-2]
[201304,"2","13","4",0.06,4.4999999999999998E-2]
[201404,"2","14","4",0.06,4.4999999999999998E-2]
[201504,"2","15","4",0.04,0.03]
[201604,"2","16","4",0.04,0.03]
[201704,"2","17","4",0.05,3.7500000000000006E-2]
[201804,"2","18","4",0.06,4.4999999999999998E-2]
[201904,"2","19","4",0.06,4.4999999999999998E-2]
[202004,"2","20","4",7.0000000000000007E-2,5.2500000000000005E-2]
[202104,"2","21","4",0.09,6.7500000000000004E-2]
[202204,"2","22","4",0.09,6.7500000000000004E-2]
{"$rows_left_out":4182}
{"sheet":"Not Eligible (data)","index":4,"n_rows":59,"n_cols":14,"rows_kept":59,"cut":false,"hidden":true,"merged":[]}
[]
[]
["Lookup","TWP ","Range","Meridian",null,null,null,null,null,"Modication History"]
[{"$f":"(B4*10000)+(C4*100)+D4","v":651406},65,14,6,"only a small part of 14 is eligible ",null,null,null,null,"2020-03-20","Martine West","No changes for 2020","Completed"]
[{"$f":"(B5*10000)+(C5*100)+D5","v":661406},66,14,6,"only a small part of 14 is eligible ",null,null,null,null,"2021-03-18","Martine West","No changes for 2021","Completed"]
[671406,67,14,6,"only a small part of 14 is eligible ",null,null,null,null,"2021-12-17","Martine West","No changes for 2022","Completed"]
[681406,68,14,6,"only a small part of 14 is eligible "]
[691506,69,15,6,0]
[691606,69,16,6,0]
[701506,70,15,6,0]
[701606,70,16,6,0]
[711506,71,15,6,0]
[711606,71,16,6,0]
[721506,72,15,6,0]
[721606,72,16,6,0]
[731506,73,15,6,0]
[731606,73,16,6,0]
[741506,74,15,6,0]
[741606,74,16,6,0]
[751406,75,14,6,0]
[751506,75,15,6,0]
[751606,75,16,6,0]
[761406,76,14,6,0]
[761506,76,15,6,0]
[761606,76,16,6,0]
[771406,77,14,6,0]
[771506,77,15,6,0]
[771606,77,16,6,0]
[781406,78,14,6,0]
[781506,78,15,6,0]
[781606,78,16,6,0]
[791406,79,14,6,0]
[791506,79,15,6,0]
[791606,79,16,6,0]
[801406,80,14,6,0]
[801506,80,15,6,0]
[801606,80,16,6,0]
[811406,81,14,6,0]
[811506,81,15,6,0]
[811606,81,16,6,0]
[821406,82,14,6,0]
[821506,82,15,6,0]
[821606,82,16,6,0]
[831406,83,14,6,0]
[831506,83,15,6,0]
[831606,83,16,6,0]
[841406,84,14,6,0]
[841506,84,15,6,0]
[841606,84,16,6,0]
[851406,85,14,6,0]
[851506,85,15,6,0]
[851606,85,16,6,0]
[861406,86,14,6,0]
[861506,86,15,6,0]
[861606,86,16,6,0]
[]
[]
[]
[null,null,null,null,null,null,null,null,null,null,null,null,null," "]

{"sheet":"Twp Rge Mer (data)","index":5,"n_rows":111,"n_cols":9,"rows_kept":111,"cut":false,"hidden":true,"merged":[]}
["Twp","Rge","Mer"]
[1,1,4,null,null,"Modication History"]
[2,2,5,null,null,"2020-03-20","Martine West","No changes for 2020","Completed"]
[3,3,6,null,null,"2021-03-18","Martine West","No changes for 2021","Completed"]
[4,4]
[5,5]
[6,6]
[7,7]
[8,8]
[9,9]
[10,10]
[11,11]
[12,12]
[13,13]
[14,14]
[15,15]
[16,16]
[17,17]
[18,18]
[19,19]
[20,20]
[21,21]
[22,22]
[23,23]
[24,24]
[25,25]
[26,26]
[27,27]
[28,28]
[29,29]
[30,30]
[31]
[32]
[33]
[34]
[35]
[36]
[37]
[38]
[39]
[40]
[41]
[42]
[43]
[44]
[45]
[46]
[47]
[48]
[49]
[50]
[51]
[52]
[53]
[54]
[55]
[56]
[57]
[58]
[59]
{"$rows_left_out":52}
{"sheet":"Offices (data)","index":6,"n_rows":39,"n_cols":14,"rows_kept":39,"cut":false,"hidden":true,"merged":[]}
["Branch Offices","AddressLine1","AddressLine2","City","PostalCode","Phone","Fax","Office Number","Honey RA",null,"Modication History"]
["Athabasca","Provincial Building","100 - 4903 50th Street ","Athabasca, AB ","T9S 1E2 ","780.675.4007","780.675.3827",444,3,null,null,"Martine West","Fix Lacombe & LaCrete office numbers","Completed"]
["Barrhead","4924 50th Avenue","PO Box 4533","Barrhead, AB ","T7N 1A4 ","780.674.8782 ","780.674.8787",442,3,null,"2021-03-18","Martine West","Updated Offices from ManualCalcCommon","Completed"]
["Brooks","Provincial Building","220 4th Avenue W ","Brooks, AB ","T1R 0G1 ","403.362.1262 ","403.362.8078 ",115,1,null,"2021-12-17","M West","Updated Spirit River address","Completed"]
["Camrose","4910 52nd Street ",null,"Camrose, AB","T4V 2V4 ","780.679.1739","780.679.1758",331,2,null,"2021-12-23","M West","Updated Lacombe DO address","Completed"]
["Claresholm","Provincial Building","PO Box 1227, 109 46th Avenue W","Claresholm, AB ","T0L 0T0 ","403.625.3534 ","403.625.2862",114,1]
["Drumheller","111 Railway Avenue West ","PO Box 2319 ","Drumheller, AB ","T0J 0Y0 ","403.823.3042 ","403.823.5083",221,2]
["Fairview","Provincial Building","PO Box 1188, 10209 109th Street","Fairview, AB","T0H 1L0","780.835.4975","780.835.3994",552,4]
["Falher","Municipal District Building","PO Box 658, 701 Main Street","Falher, AB","T0H 1M0","780.837.2521","780.837.8223",557,4]
["Foremost","218 Main Street","PO Box 37","Foremost, AB","T0K 0X0","403.867.3666","403.867.2038",120,1]
["Grande Prairie","102 - 10625 Westside Drive",null,"Grande Prairie, AB","T8V 8E6","780.538.5220","780.532.2560",555,4]
["Grimshaw","5306 50th Street","PO Box 802","Grimshaw, AB","T0H 1W0","780.332.4494","780.332.1044",554,4]
["Hanna","Provincial Building","PO Box 339, 401 Centre Street","Hanna, AB","T0J 1P0","403.854.5525","403.854.2590",225,2]
["La Crete","10105 94th Avenue  ","PO Box 1420","La Crete, AB","T0H 2H0","780.928.2178","780.928.2819",562,4]
["Lacombe","5718 - 56 Avenue",null,"Lacombe, AB","T4L 1B1","877.899.2372","855.700.2372",230,2]
["Lamont","5014 50th Avenue","PO Box 487","Lamont, AB","T0B 2R0","780.895.2266","780.895.7755",441,3]
["Leduc","6547 Sparrow Drive",null,"Leduc, AB","T9E 7C7","780.986.4088","780.986.1085",446,3]
["Lethbridge","County of Lethbridge Building    ","200 - 905 4th Avenue S.","Lethbridge, AB","T1J 0P4","403.381.5240","403.382.4527",112,1]
["Medicine Hat","111 - 7 Strachan Bay SE",null,"Medicine Hat, AB","T1B 4Y2","403.488.4509","403.488.4516",113,1]
["Olds","Provincial Building","101 - 5030 50th Street","Olds, AB","T4H 1S1","403.556.4334","403.556.4255",227,2]
["Oyen","201 Main Street","PO Box 426","Oyen, AB","T0J 2J0","403.664.3677","403.664.2687",232,2]
["Ponoka","Provincial Building","PO Box 4426, 250 - 5110 49th Avenue ","Ponoka, AB","T4J 1S1","403.783.7071","403.783.7925",226,2]
["Provost","Provincial Building","PO Box 716, 5419 44th Street ","Provost, AB","T0B 3S0","780.753.2150","780.753.2876",336,2]
["Red Deer","1 - 7710 Gaetz Avenue",null,"Red Deer, AB","T4P 2A5","403.340.5379","403.340.7999",222,2]
["Rocky View County","2 - 261024 Dwight McLellan Trail",null,"Rocky View County, AB","T4A 0T5","403.297.6281","403.297.8461",235,2]
["Sedgewick","4701 48th Avenue","PO Box 266","Sedgewick, AB","T0B 4C0","780.384.3880","780.384.2156",333,2]
["Spirit River","Municipal District of Spirit River","#133, 4202 50th Street","Spirit River, AB","T0H 3G0","780.864.3986","780.864.2529",553,4]
["St. Paul","4321 50th Ave",null,"St. Paul, AB","T0A 3A3","780.645.6453","780.645.2848",334,3]
["Stettler","5020 50th Street","PO Box 1807","Stettler, AB","T0C 2L0","403.740.4200","403.740.4210",224,2]
["Stony Plain","Provincial Building","4709 44th Avenue","Stony Plain, AB","T7Z 1N4","780.963.0600","780.963.1251",447,3]
["Strathmore","325 3rd Avenue",null,"Strathmore, AB","T1P 1B4","403.934.3616","403.934.5018",119,2]
["Taber","Provincial Building","PO Box 4, 5011 49th Avenue","Taber, AB","T1G 1V9","403.223.7900","403.223.7985",117,1]
["Thorhild","County Administration Building","PO Box 400, 801 1st Street ","Thorhild, AB","T0A 3J0","780.398.3933","780.398.2087",449,3]
["Three Hills","Provincial Building","PO Box 40, 128 3rd Avenue S ","Three Hills, AB","T0M 2A0","403.443.8515","403.443.7519",228,2]
["Vegreville","Vinet's Village Mall","PO Box 1440, 138 - 4925 50th Avenue ","Vegreville, AB","T9C 1S6","780.603.2332","780.632.3385",335,3]
["Vermilion","5039 49th Avenue",null,"Vermilion, AB","T9X 1B8","780.581.2345","780.853.1982",332,3]
["Vulcan","104 Centre Street East","PO Box 847","Vulcan, AB","T0L 2B0","403.485.2766","403.485.2947",118,1]
["Wainwright","2710 15th Avenue",null,"Wainwright, AB","T9W 0A4","780.842.7547","780.842.4948",337,3]
["Westlock","11207 104th Avenue",null,"Westlock, AB","T7P 1B2","780.349.4544","780.349.5240",445,2]

{"sheet":"Properties (Data)","index":7,"n_rows":12,"n_cols":10,"rows_kept":12,"cut":false,"hidden":true,"merged":[[0,0,0,1],[0,3,0,4]]}
["Common Properties",null,null,"Local Properties"]
["Property","Value",null,"Property","Value"]
["Hail Factor",0.38300000000000001,null,"Datafile","St Hail Calculator"]
["ReplyEmailAddress","Info@afsc.ca",null,"CropYear",2023]
["LogoFile","CAP AFSC AB CAN bw.jpg",null,null,null,null,"Current Path","\\\\hs-teams.afsc.ca@SSL\\DavWWWRoot\\pnp\\pnp\\Calculators\\"]
["DataFilePath1","\\\\hs-teams.afsc.ca@SSL\\DavWWWRoot\\pnp\\pnp\\Calculators\\"]
["DataFilePath2","\\\\homestead.afsc.ca@SSL\\DavWWWRoot\\wrkres\\Documents",null,"WorkBookName","St Hail Calculator",null,"Modication History"]
["CommonDataFile","ManualCalcCommonData",null,null,null,null,"2020-03-20","Martine West","Updated year","Completed"]
["ModulePath","\\\\hs-teams.afsc.ca@SSL\\DavWWWRoot\\pnp\\pnp\\Calculators\\",null,null,null,null,"2020-12-11","Martine West","Updated year","Completed"]
["ModuleName","CalculatorMacros.code",null,null,null,null,"2021-03-18","Martine West","Updated hail and formatted to four decimal places","Completed"]
[null,null,null,null,null,null,"2023-02-15","J Baumgartner","Updated Hail Factor and crop year","Completed"]
[null,null,null,null,null,null,"2023-04-13","M West","Fixed as per I2304-0161","Completed"]