{"text_format":"1","workbook":"xlsx","n_sheets":4,"sheets":["Notes","History Rate Chart","Data","Properties (data)"],"not_rendered":{"charts":1,"images":3,"macros":1,"external_links":0,"defined_names":8,"comments":0,"pivot_tables":0},"unopened":[],"bounds":{"document_bytes":16777216,"sheet_cells":100000,"rows_first":2000,"rows_last":500,"rows_between":2000,"halvings":0,"cell_chars":16384,"cell_head_chars":4096},"cells_cut":0,"cells_raw":0,"read":"whole","date_system":"1900"}

{"sheet":"Notes","index":0,"n_rows":4,"n_cols":11,"rows_kept":4,"cut":false,"hidden":false,"merged":[[1,1,1,11],[3,8,3,9],[2,10,3,11],[0,1,0,11]]}
[null,"Moisture Deficiency Insurance (MDI) Program"]
[]
[null,null,null,null,null,null,null,null,null,null,{"$f":"Crop_Year","v":2024}]
[null,null,null,null,null,null,null,null,"Crop Year"]

{"sheet":"History Rate Chart","index":1,"n_rows":53,"n_cols":28,"rows_kept":53,"cut":false,"hidden":false,"merged":[[40,1,40,2],[41,1,41,2],[40,3,40,6],[41,3,41,6],[42,1,42,2],[42,3,42,6],[6,26,7,26],[0,1,0,21],[1,1,1,21],[3,1,3,16],[38,1,38,21],[43,1,43,2],[43,3,43,6],[44,1,44,2],[44,3,44,6],[47,1,49,21],[40,7,40,10],[41,7,41,10],[42,7,42,10],[43,7,43,10],[44,7,44,10]]}
[null,"History of Moisture Deficiency Insurance (MDI) Payment Rates ",null,null,null,null,null,null,null,null,null,null,null,null,null,null,null,null,null,null,null,null,null,null,null,"Hide here and after"]
[null,{"$f":"\"Based on \" & Crop_Year &\" Moisture Normals\"","v":"Based on 2024 Moisture Normals"},null,null,null,null,null,null,null,null,null,null,null,null,null,null,null,null,null,null,null,null,null,null,null,null,null,"<hide>"]
[]
[null,"As calculated by the AFSC Actuarial Department"]
[]
[null,null,null,null,null,null,null,null,null,null,null,null,null,null,null,"Choose your weighting option."]
[null,"Choose up to three weather station locations."]
[]
[null,1]
[null,2]
[null,3]
[]
[]
[]
[]
[]
[null,null,"Payment Rate History"]
[null,null,{"$f":"Crop_Year-20","v":2004},{"$f":"Crop_Year-19","v":2005},{"$f":"Crop_Year-18","v":2006},{"$f":"Crop_Year-17","v":2007},{"$f":"Crop_Year-16","v":2008},{"$f":"Crop_Year-15","v":2009},{"$f":"Crop_Year-14","v":2010},{"$f":"Crop_Year-13","v":2011},{"$f":"Crop_Year-12","v":2012},{"$f":"Crop_Year-11","v":2013},{"$f":"Crop_Year-10","v":2014},{"$f":"Crop_Year-9","v":2015},{"$f":"Crop_Year-8","v":2016},{"$f":"Crop_Year-7","v":2017},{"$f":"Crop_Year-6","v":2018},{"$f":"Crop_Year-5","v":2019},{"$f":"Crop_Year-4","v":2020},{"$f":"Crop_Year-3","v":2021},{"$f":"Crop_Year-2","v":2022},{"$f":"Crop_Year-1","v":2023}]
[null,1,{"$f":"IFERROR(INDEX((OptA),Data!$E$1,1),0)","v":0},{"$f":"IFERROR(INDEX((OptA),Data!$E$1,2),0)","v":0},{"$f":"IFERROR(INDEX((OptA),Data!$E$1,3),0)","v":0},{"$f":"IFERROR(INDEX((OptA),Data!$E$1,4),0)","v":0},{"$f":"IFERROR(INDEX((OptA),Data!$E$1,5),0)","v":0},{"$f":"IFERROR(INDEX((OptA),Data!$E$1,6),0)","v":0},{"$f":"IFERROR(INDEX((OptA),Data!$E$1,7),0)","v":0},{"$f":"IFERROR(INDEX((OptA),Data!$E$1,8),0)","v":0},{"$f":"IFERROR(INDEX((OptA),Data!$E$1,9),0)","v":0},{"$f":"IFERROR(INDEX((OptA),Data!$E$1,10),0)","v":0},{"$f":"IFERROR(INDEX((OptA),Data!$E$1,11),0)","v":0},{"$f":"IFERROR(INDEX((OptA),Data!$E$1,12),0)","v":0},{"$f":"IFERROR(INDEX((OptA),Data!$E$1,13),0)","v":0},{"$f":"IFERROR(INDEX((OptA),Data!$E$1,14),0)","v":0},{"$f":"IFERROR(INDEX((OptA),Data!$E$1,15),0)","v":0},{"$f":"IFERROR(INDEX((OptA),Data!$E$1,16),0)","v":0},{"$f":"IFERROR(INDEX((OptA),Data!$E$1,17),0)","v":0},{"$f":"IFERROR(INDEX((OptA),Data!$E$1,18),0)","v":0},{"$f":"IFERROR(INDEX((OptA),Data!$E$1,19),0)","v":0},{"$f":"IFERROR(INDEX((OptA),Data!$E$1,20),0)","v":0}]
[null,2,{"$f":"IFERROR(INDEX((OptA),Data!$E$2,1),0)","v":0},{"$f":"IFERROR(INDEX((OptA),Data!$E$2,2),0)","v":0},{"$f":"IFERROR(INDEX((OptA),Data!$E$2,3),0)","v":0},{"$f":"IFERROR(INDEX((OptA),Data!$E$2,4),0)","v":0},{"$f":"IFERROR(INDEX((OptA),Data!$E$2,5),0)","v":0},{"$f":"IFERROR(INDEX((OptA),Data!$E$2,6),0)","v":0},{"$f":"IFERROR(INDEX((OptA),Data!$E$2,7),0)","v":0},{"$f":"IFERROR(INDEX((OptA),Data!$E$2,8),0)","v":0},{"$f":"IFERROR(INDEX((OptA),Data!$E$2,9),0)","v":0},{"$f":"IFERROR(INDEX((OptA),Data!$E$2,10),0)","v":0},{"$f":"IFERROR(INDEX((OptA),Data!$E$2,11),0)","v":0},{"$f":"IFERROR(INDEX((OptA),Data!$E$2,12),0)","v":0},{"$f":"IFERROR(INDEX((OptA),Data!$E$2,13),0)","v":0},{"$f":"IFERROR(INDEX((OptA),Data!$E$2,14),0)","v":0},{"$f":"IFERROR(INDEX((OptA),Data!$E$2,15),0)","v":0},{"$f":"IFERROR(INDEX((OptA),Data!$E$2,16),0)","v":0},{"$f":"IFERROR(INDEX((OptA),Data!$E$2,17),0)","v":0},{"$f":"IFERROR(INDEX((OptA),Data!$E$2,18),0)","v":0},{"$f":"IFERROR(INDEX((OptA),Data!$E$2,19),0)","v":0},{"$f":"IFERROR(INDEX((OptA),Data!$E$2,20),0)","v":0}]
[null,3,{"$f":"IFERROR(INDEX((OptA),Data!$E$3,1),0)","v":0},{"$f":"IFERROR(INDEX((OptA),Data!$E$3,2),0)","v":0},{"$f":"IFERROR(INDEX((OptA),Data!$E$3,3),0)","v":0},{"$f":"IFERROR(INDEX((OptA),Data!$E$3,4),0)","v":0},{"$f":"IFERROR(INDEX((OptA),Data!$E$3,5),0)","v":0},{"$f":"IFERROR(INDEX((OptA),Data!$E$3,6),0)","v":0},{"$f":"IFERROR(INDEX((OptA),Data!$E$3,7),0)","v":0},{"$f":"IFERROR(INDEX((OptA),Data!$E$3,8),0)","v":0},{"$f":"IFERROR(INDEX((OptA),Data!$E$3,9),0)","v":0},{"$f":"IFERROR(INDEX((OptA),Data!$E$3,10),0)","v":0},{"$f":"IFERROR(INDEX((OptA),Data!$E$3,11),0)","v":0},{"$f":"IFERROR(INDEX((OptA),Data!$E$3,12),0)","v":0},{"$f":"IFERROR(INDEX((OptA),Data!$E$3,13),0)","v":0},{"$f":"IFERROR(INDEX((OptA),Data!$E$3,14),0)","v":0},{"$f":"IFERROR(INDEX((OptA),Data!$E$3,15),0)","v":0},{"$f":"IFERROR(INDEX((OptA),Data!$E$3,16),0)","v":0},{"$f":"IFERROR(INDEX((OptA),Data!$E$3,17),0)","v":0},{"$f":"IFERROR(INDEX((OptA),Data!$E$3,18),0)","v":0},{"$f":"IFERROR(INDEX((OptA),Data!$E$3,19),0)","v":0},{"$f":"IFERROR(INDEX((OptA),Data!$E$3,20),0)","v":0}]
[null,"Average",{"$f":"IFERROR(SUM(C19:C21)/Data!$E$4,0)","v":0},{"$f":"IFERROR(SUM(D19:D21)/Data!$E$4,0)","v":0},{"$f":"IFERROR(SUM(E19:E21)/Data!$E$4,0)","v":0},{"$f":"IFERROR(SUM(F19:F21)/Data!$E$4,0)","v":0},{"$f":"IFERROR(SUM(G19:G21)/Data!$E$4,0)","v":0},{"$f":"IFERROR(SUM(H19:H21)/Data!$E$4,0)","v":0},{"$f":"IFERROR(SUM(I19:I21)/Data!$E$4,0)","v":0},{"$f":"IFERROR(SUM(J19:J21)/Data!$E$4,0)","v":0},{"$f":"IFERROR(SUM(K19:K21)/Data!$E$4,0)","v":0},{"$f":"IFERROR(SUM(L19:L21)/Data!$E$4,0)","v":0},{"$f":"IFERROR(SUM(M19:M21)/Data!$E$4,0)","v":0},{"$f":"IFERROR(SUM(N19:N21)/Data!$E$4,0)","v":0},{"$f":"IFERROR(SUM(O19:O21)/Data!$E$4,0)","v":0},{"$f":"IFERROR(SUM(P19:P21)/Data!$E$4,0)","v":0},{"$f":"IFERROR(SUM(Q19:Q21)/Data!$E$4,0)","v":0},{"$f":"IFERROR(SUM(R19:R21)/Data!$E$4,0)","v":0},{"$f":"IFERROR(SUM(S19:S21)/Data!$E$4,0)","v":0},{"$f":"IFERROR(SUM(T19:T21)/Data!$E$4,0)","v":0},{"$f":"IFERROR(SUM(U19:U21)/Data!$E$4,0)","v":0},{"$f":"IFERROR(SUM(V19:V21)/Data!$E$4,0)","v":0}]
[]
[]
[]
[]
[]
[]
[]
[]
[]
[]
[]
[]
[]
[]
[]
[null,"Note:"]
[null,"Payment rates reflected in this calculator do not reflect actual payment rates but utilize the precipitation data to determine payment rates based on current payment rate methodology. "]
[]
[null,null,null,"2022 prior coverage splits",null,null,null,"2023 onwards coverage splits"]
[null,"A Short",null,"60/40",null,null,null,"40/40/20/0"]
[null,"B Short",null,"55/45",null,null,null,"40/30/30/0"]
[null,"C Long",null,"60/40",null,null,null,"30/30/20/20"]
[null,"D Long",null,"50/50",null,null,null,"25/25/25/25"]
[]
[null,"DISCLAIMER:"]
[null,"Not all weather stations have a complete moisture history. In these cases, moisture is estimated from neighboring stations. This calculator is for your convenience and is intended for information purposes, based on selected coverage options and weather stations."]
[]
[]
[]
[]
[null,"Hide here and after"]

{"sheet":"Data","index":2,"n_rows":1045,"n_cols":49,"rows_kept":1045,"cut":false,"hidden":true,"merged":[]}
[{"$f":"IF(B1=2,\"A\",IF(B1=3,\"B\",IF(B1=4,\"C\",IF(B1=5,\"D\",\"\"))))","v":"A"},2,{"$f":"B1-1","v":1},1,{"$f":"MATCH(G1,$AA$6:$AA$1045,0)","v":{"$error":"#VALUE!"}},{"$f":"INDEX($AC$5:$AC$264,D1-1)","v":{"$error":"#VALUE!"}},{"$f":"F1&$A$1","v":{"$error":"#VALUE!"}},null,null,null,null,null,null,null,null,null,null,null,null,null,null,null,null,null,null,null,null,null,null,null,null,null,null,null,null,null,null,null,null,null,null,null,null,null,null,"Note:  If you add or removed rows you need to update the named ranges for OptA, OptB, OptC, OptD"]
[null,null,null,1,{"$f":"MATCH(G2,$AA$6:$AA$1045,0)","v":{"$error":"#VALUE!"}},{"$f":"INDEX($AC$5:$AC$264,D2-1)","v":{"$error":"#VALUE!"}},{"$f":"F2&$A$1","v":{"$error":"#VALUE!"}},null,null,null,null,null,null,null,null,null,null,null,null,null,null,null,null,null,null,null,null,null,null,null,null,null,null,null,null,null,null,null,null,null,null,null,null,null,null,"Also update the ranges on the dropdowns for the weather station locations on the History Rate tab."]
[null,null,null,1,{"$error":"#VALUE!"},{"$f":"INDEX($AC$5:$AC$264,D3-1)","v":{"$error":"#VALUE!"}},{"$error":"#VALUE!"},null,null,null,null,null,null,null,null,null,null,null,null,null,null,null,null,null,null,null,null,"WS DropDown"]
[null,null,null,null,{"$f":"COUNT(E1:E3)","v":0},null,null,null,null,null,null,null,null,null,null,null,null,null,null,null,null,null,null,null,null,null,"LookupKey"]
[null,"A. Short (40/40/20/0)","Risk_Area",null,"Option",2004,2005,2006,2007,2008,2009,2010,2011,2012,2013,2014,2015,2016,2017,2018,2019,2020,2021,2022,2023,null,null,{"$f":"_xlfn._xlws.FILTER(C6:E1045,E6:E1045=A1,\"\")","v":90},"Abee","A",null,null,null,null,null,null,null,null,null,null,null,null,null,null,null,"Modification History","Updated by","Description of Update","Status"]
[null,"B. Short (40/30/30/0)",90,"Abee","A",30,1,0,20,70,90,4,40,26,28,8,70,8,0,49,26,0,65,10,0,null,{"$f":"D6&E6","v":"AbeeA"},204,"Acadia Valley","A",null,null,null,null,null,null,null,null,null,null,null,null,null,null,null,null,"M West","Updated Weather Stations, deleted 2000 column, added 2020 column","Complete"]
[null,"C. Long (30/30/20/20)",90,"Abee","B",22.5,1.5,0,30,65,80,3,40,19.5,28,6,65,12,0,54.5,26,0,60,15,0,null,{"$f":"D7&E7","v":"AbeeB"},304,"Aden","A",null,null,null,null,null,null,null,null,null,null,null,null,null,null,null,null,"M West","Inserted new data from MDI data for newcalc 2021","Complete"]
[null,"D. Long (25/25/25/25)",90,"Abee","C",32.5,1,0,40,70,90,3,43,19.5,21,23,85,8,0,39.5,20.5,0,50,11,0,null,"AbeeC",160,"Albert Hall","A",null,null,null,null,null,null,null,null,null,null,null,null,null,null,null,null,"M West","Updated Weather Stations, deleted 2001 column, added 2021 column","Complete"]
[null,4,90,"Abee","D",31.25,1.25,0,55,70,90,2.5,41.25,16.25,17.5,26.25,90,10,0,37.5,17.5,0,45,13.75,0,null,"AbeeD",151,"Alliance","A",null,null,null,null,null,null,null,null,null,null,null,null,null,null,null,null,"M West","Inserted new data from MDI data for newcalc 2022","Complete"]
[null,5,204,"Acadia Valley","A",0,32,20,0,0,46,0,4,16,0,32,100,0,35,8,90,6,80,40,80,null,"Acadia ValleyA",91,"Andrew","A",null,null,null,null,null,null,null,null,null,null,null,null,null,null,null,"2023-01-16","M West","Updated data from T:\\Final Docs by Project\\Actuarial Tables\\ActTable2023\\Calculator\\MDI data for calculator2023v2.xlsx"]
[null,6,204,"Acadia Valley","B",0,37,30,0,0,38,0,4,24,0,32,100,0,60,10,95,9,80,36,65,null,"Acadia ValleyB",259,"Ardenville","A",null,null,null,null,null,null,null,null,null,null,null,null,null,null,null,"2023-12-14","J Baumgartner","Updated data from T:\\ActTable2024\\Calculator for MDI data for calculator2024.xlsx"]
[null,7,204,"Acadia Valley","C",0,26.5,20,0,1,34.5,0,19,36,20,24,85,0,60,6,65,55,85,80,95,null,"Acadia ValleyC",161,"Athabasca","A",null,null,null,null,null,null,null,null,null,null,null,null,null,null,null,"2024-01-09","J Baumgartner","Update the named ranges for OptA, OptB, OptC, OptD to account for additional rows.\nAlso updated the ranges on the dropdowns for the weather station locations on the History Rate tab to account for additional weather stations."]
[null,8,204,"Acadia Valley","D",0,26.25,25,0,1.25,28.75,0,22.5,45,25,20,65,0,75,10,60,70,90,85,90,null,"Acadia ValleyD",203,"Atlee","A"]
[null,9,304,"Aden","A",0,60,22,100,0,50,0,20,20,0,22,80,4,100,85,100,20,100,26,0,null,"AdenA",92,"Atmore","A"]
[null,10,304,"Aden","B",0,80,40,100,0,40,0,30,30,0,32,64,3,100,100,100,30,100,26,0,null,"AdenB",202,"Azure","A"]
[null,11,304,"Aden","C",0,50,45,100,0,45,0,40,40,8,21.5,100,3,100,100,90,40,100,19.5,0,null,"AdenC",46,"Ballater","A"]
[null,12,304,"Aden","D",0,50,70,100,0,35,0,50,65,10,26.25,90,2.5,100,100,95,60,100,16.25,0,null,"AdenD",54,"Barnwell","A"]
[null,13,160,"Albert Hall","A",0,0,0,20,40,95,0,40,0,30,16,90,4,1,35,40,0,28,0,60,null,"Albert HallA",146,"Barons","A"]
[null,14,160,"Albert Hall","B",0,0,0,30,40,95,0,40,0,30,16,64,3,1.5,35,40,0,30,0,55,null,"Albert HallB",249,"Barrhead","A"]
[null,15,160,"Albert Hall","C",0,0,4,20,10.5,60,0,46,2,22.5,12,54,14,3,50,30,0,41,20,24,null,"Albert HallC",147,"Bassano","A"]
[null,16,160,"Albert Hall","D",0,0,5,25,8.75,50,0,45,2.5,18.75,10,45,16.25,3.75,50,25,0,46.25,25,20,null,"Albert HallD",132,"Battle River","A"]
[null,17,151,"Alliance","A",15,16,0,20,23,80,0,34,0,2,16,85,0,70,50,10,0,32,0,100,null,"AllianceA",242,"Beaverdam","A"]
[null,18,151,"Alliance","B",13,16,0,30,35,70,0,34,0,3,16,75,0,80,50,10,0,34.5,0,100,null,"AllianceB",47,"Beaverlodge","A"]
[null,19,151,"Alliance","C",10.5,12,0,21,25,40.5,0,45.5,19,2,12,40.5,0,65,80,13.5,0,55,20,95,null,"AllianceC",149,"Beiseker","A"]
[null,20,151,"Alliance","D",8.75,10,0,40,35,33.75,0,46.25,23.75,2.5,10,33.75,0,70,85,13.75,0,70,25,90,null,"AllianceD",162,"Bellshill","A"]
[null,21,91,"Andrew","A",25,0,12,25,60,100,0,40,30,40,0,15,12,0,34,40,0,5,19,0,null,"AndrewA",163,"Big Valley","A"]
[null,22,91,"Andrew","B",16.5,0,9,45,50,100,0,40,22.5,50,0,7.5,9,0,34,40,0,3,25.5,0,null,"AndrewB",201,"Black Diamond","A"]
[null,23,91,"Andrew","C",20,5,9,40,19.5,100,0,30,22.5,30,20,30,9,1,25.5,37,0,3,22.5,0,null,"AndrewC",233,"Blackie","A"]
[null,24,91,"Andrew","D",13.75,5,7.5,45,16.25,100,0,25,18.75,30,25,26.25,7.5,1.25,21.25,33.75,0,2.5,30,0,null,"AndrewD",70,"Bodo","A"]
[null,25,259,"Ardenville","A",6,58,20,70,0,28,0,0,0,0,28,50,0,55,45,21,20,75,38,100,null,"ArdenvilleA",1,"Bow Island South","A"]
[null,26,259,"Ardenville","B",9,67,50,85,0,26,0,0,0,0,38,40,0,75,55,21,30,85,38,100,null,"ArdenvilleB",82,"Breton","A"]
[null,27,259,"Ardenville","C",6,48,55,100,12,21,0,9,17,0,26,50,0,100,70,20,40,45,44.5,90,null,"ArdenvilleC",63,"Brocket","A"]
[null,28,259,"Ardenville","D",7.5,47.5,75,100,15,17.5,0,11.25,21.25,0,30,45,0,100,75,25,50,45,43.75,95,null,"ArdenvilleD",2,"Brooks","A"]
[null,29,161,"Athabasca","A",40,0,3,20,11,100,2,40,12,30,5,65,8,0,30,40,0,50,15,0,null,"AthabascaA",164,"Brownvale","A"]
[null,30,161,"Athabasca","B",30,0,4.5,30,20,100,3,40,9,30,0,55,12,0,30,40,0,48,22.5,0,null,"AthabascaB",64,"Btap","A"]
[null,31,161,"Athabasca","C",30,7,3,22,15,80,2,45,9,25,25,60,8,0,26.5,30,0,55,15,0,null,"AthabascaC",103,"Buffalo","A"]
[null,32,161,"Athabasca","D",25,8.75,3.75,27.5,20,70,2.5,43.75,7.5,25,25,50,10,0,23.75,25,0,65,18.75,0,null,"AthabascaD",210,"Bullhorn Coulee Reservoir Inlet","A"]
[null,33,203,"Atlee","A",6,49,20,25,0,60,0,8,20,14,16,100,0,75,40,100,0,80,0,100,null,"AtleeA",209,"Bullhorn Headwater","A"]
[null,34,203,"Atlee","B",4.5,57.5,30,65,0,52,0,8,30,14,16,100,0,100,40,100,0,80,0,100,null,"AtleeB",227,"Bullsprings","A"]
[null,35,203,"Atlee","C",4.5,41,31,50,0,42,0,20,40,10.5,12,95,0,100,32,90,20,90,20,100,null,"AtleeC",84,"Busby","A"]
[null,36,203,"Atlee","D",3.75,41.25,38.75,80,0,35,0,22.5,50,8.75,10,75,0,100,27.5,85,25,100,25,100,null,"AtleeD",214,"Cabin Lake","A"]
[null,37,92,"Atmore","A",28,0,1,20,20,95,0,40,36,26,4,50,1,0,37,40,0,54,6,0,null,"AtmoreA",137,"Cadogan","A"]
[null,38,92,"Atmore","B",21,0,1.5,30,30,95,0,40,27,26,4,50,1.5,0,40.5,40,0,51,9,0,null,"AtmoreB",24,"Calgary","A"]
[null,39,92,"Atmore","C",21,3,1,31,6,75,0,30,27,31.5,17,60,1,0,29.5,30,0,45,6,0,null,"AtmoreC",29,"Campsie","A"]
[null,40,92,"Atmore","D",17.5,3.75,1.25,38.75,7.5,70,0,25,22.5,31.25,20,60,1.25,0,27.5,25,0,43.75,7.5,0,null,"AtmoreD",33,"Camrose","A"]
[null,41,202,"Azure","A",0,38,15,20,0,50,10,0,0,0,19,5,30,60,40,0,20,40,26,80,null,"AzureA",262,"Cappon","A"]
[null,42,202,"Azure","B",0,38,22.5,30,0,35,7.5,0,0,0,28.5,5,22.5,60,45,0,30,30,26,85,null,"AzureB",8,"Cardston","A"]
[null,43,202,"Azure","C",0,28.5,15,20,0,30,7.5,3,0,0,19,0,23.5,85,50,0,50,30,19.5,50,null,"AzureC",266,"Carrot Creek","A"]
[null,44,202,"Azure","D",0,23.75,18.75,25,0,25,6.25,3.75,0,0,23.75,0,20,95,50,0,70,25,16.25,45,null,"AzureD",301,"Carseland","A"]
[null,45,46,"Ballater","A",18,0,0,20,40,70,56,2,0,22,70,100,0,10,40,40,0,65,45,22,null,"BallaterA",272,"Carway","A"]
[null,46,46,"Ballater","B",13.5,0,0,30,45,55,57,2,0,22,80,100,0,7.5,40,40,0,70,50,16.5,null,"BallaterB",231,"Cereal","A"]
[null,47,46,"Ballater","C",13.5,0,0,20,45,75,47,2.5,0,36.5,100,80,0,7.5,30,30,1,55,55,16.5,null,"BallaterC",65,"Champion","A"]
[null,48,46,"Ballater","D",11.25,0,0,25,50,75,47.5,2.5,0,38.75,100,80,0,6.25,25,25,1.25,60,65,13.75,null,"BallaterD",93,"Chisholm","A"]
[null,49,54,"Barnwell","A",0,52,44,60,0,38,9,10,9,0,16,75,14,80,85,55,20,100,40,100,null,"BarnwellA",9,"Claresholm","A"]
[null,50,54,"Barnwell","B",0,65,65,100,0,36.5,13.5,15,13.5,0,24,55,10.5,100,95,50,30,100,40,100,null,"BarnwellB",104,"Cleardale","A"]
[null,51,54,"Barnwell","C",0,44,40,60,5,28.5,9,30,29,17,16,95,10.5,100,100,35,40,100,50,100,null,"BarnwellC",294,"Comrey","A"]
[null,52,54,"Barnwell","D",0,45,55,85,6.25,23.75,11.25,37.5,36.25,21.25,20,95,8.75,100,100,30,50,100,50,100,null,"BarnwellD",71,"Consort","A"]
[null,53,146,"Barons","A",0,55,40,20,0,62,0,0,11,0,20,80,0,100,100,40,12,85,40,100,null,"BaronsA",20,"Coronation","A"]
[null,54,146,"Barons","B",0,62.5,50,50,0,55,0,0,16.5,0,30,75,0,100,100,30,18,65,40,95,null,"BaronsB",134,"Craigmyle","A"]
[null,55,146,"Barons","C",0,45,40,30,0,46.5,0,20,11,3,21,85,0,100,100,30,32,60,47,95,null,"BaronsC",165,"Crestomere","A"]
[null,56,146,"Barons","D",0,43.75,43.75,50,0,38.75,0,25,13.75,3.75,26.25,85,0,100,100,25,40,50,46.25,85,null,"BaronsD",273,"Cross Drain 5","A"]
[null,57,249,"Barrhead","A",36,0,10,8,27,90,40,26,18,0,5,70,0,2,60,12,0,50,21,0,null,"BarrheadA",217,"Deadwood","A"]
[null,58,249,"Barrhead","B",27,0,15,12,24,80,30,26,13.5,0,0,70,0,2,50,12,0,51,29.5,0,null,"BarrheadB",66,"Del Bonita","A"]
[null,59,249,"Barrhead","C",31,0,22,8,45,80,30,19.5,13.5,1,20,90,0,3.5,35,24,2,56,30,0,null,"BarrheadC",159,"Delburne","A"]
[null,60,249,"Barrhead","D",27.5,0,27.5,10,50,75,25,16.25,11.25,1.25,25,95,0,3.75,25,26.25,2.5,65,36.25,0,null,"BarrheadD",94,"Dewberry","A"]
[null,61,147,"Bassano","A",0,45,20,20,0,40,1,40,18,0,15,95,36,25,40,60,2,100,40,75,null,"BassanoA",124,"Dickson Dam","A"]
[null,62,147,"Bassano","B",0,47.5,30,30,0,40,1.5,20,27,0,25,80,27,45,40,60,3,100,40,60,null,"BassanoB",289,"Divide Hills","A"]
[null,63,147,"Bassano","C",0,35,20,20,20,30,5,35,24,20,7,51,27,60,46,55,22,100,30,85,null,"BassanoC",22,"Drumheller","A"]
[null,64,147,"Bassano","D",0,31.25,25,25,25,25,6.25,30,30,25,8.75,42.5,22.5,80,45,50,27.5,100,25,80,null,"BassanoD",267,"Duck Lake","A"]
[null,65,132,"Battle River","A",0,8,35,7,35,80,0,8,0,4,5,50,0,9,50,8,0,20,0,9,null,"Battle RiverA",166,"Dupre","A"]
[null,66,132,"Battle River","B",0,12,35,10.5,40,75,0,8,0,3,5,45,0,13.5,55,8,0,15,0,13.5,null,{"$f":"D71&E71","v":"Battle RiverB"},167,"Eaglesham","A"]
[null,67,132,"Battle River","C",0,8,10,7,35,65,0,26,2,3,20,50,0,17,45,7,0,15,11,9,null,"Battle RiverC",112,"Edgerton","A"]
[null,68,132,"Battle River","D",0,10,1.25,8.75,35,60,0,30,2.5,2.5,25,45,0,21.25,45,6.25,0,12.5,13.75,11.25,null,"Battle RiverD",34,"Edmonton","A"]
[null,69,242,"Beaverdam","A",0,0,28,4,0,55,0,40,0,40,0,80,0,0,22,40,9,35,0,65,null,"BeaverdamA",87,"Edson","A"]
[null,70,242,"Beaverdam","B",0,0,21,6,0,60,0,40,0,50,0,70,0,0,22,40,9.5,55,0,65,null,"BeaverdamB",76,"Elbow","A"]
[null,71,242,"Beaverdam","C",7,0,21,4,10,60,0,30,0,35,12,65,0,11,16.5,41,7,50,14,30,null,"BeaverdamC",95,"Elk Island Park","A"]
[null,72,242,"Beaverdam","D",8.75,0,17.5,5,15,55,0,25,0,35,15,55,0,13.75,13.75,38.75,6.25,60,17.5,25,null,"BeaverdamD",56,"Enchant","A"]
[null,73,47,"Beaverlodge","A",30,0,40,19,90,40,52,40,45,0,45,21,0,10,50,0,0,60,14,0,null,"BeaverlodgeA",16,"Esther","A"]
[null,74,47,"Beaverlodge","B",25,0,30,28.5,90,30,48,40,55,0,45,30.5,0,15,40,0,0,49.5,21,0,null,"BeaverlodgeB",140,"Etzikom","A"]
[null,75,47,"Beaverlodge","C",13.5,0,50,19,65,47,42,43,55,0,55,20.5,0,10,30,0,13,43,30,0,null,"BeaverlodgeC",279,"Eureka River","A"]
{"$rows_left_out":966}
{"sheet":"Properties (data)","index":3,"n_rows":11,"n_cols":11,"rows_kept":11,"cut":false,"hidden":true,"merged":[[0,2,0,3]]}
[null,"Common Properites","Local Properties"]
["Property","Value","Property","Value",null,null,null,"Modification History","Updated by","Description of Update","Status"]
["Hail Factor",0,"Crop Year",2024,null,null,null,"2020-11-19","Martine West","Updated year, path, powerusers","Completed"]
["ReplyEmailAddress","Info@afsc.ca","WorkBookName","MDI_Pymt_History_Calc",null,null,null,"2021-12-06","Martine West","Updated year","Completed"]
["LogoFile","CAP AFSC AB CAN bw.jpg","PowerUsers","<bnewman><mbarefoot>",null,null,null,"2023-01-12","Martine West","Updated year","Completed"]
["DataFilePath1","\\\\hs-teams.afsc.ca@SSL\\DavWWWRoot\\pnp\\pnp\\Calculators\\",null,null,null,null,null,"2023-12-07","Jim Baumgartner","Updated year","Completed"]
["DataFilePath2","\\\\homestead.afsc.ca@SSL\\DavWWWRoot\\wrkres\\Documents"]
["CommonDataFile","ManualCalcCommonData"]
["ModulePath","\\\\hs-teams.afsc.ca@SSL\\DavWWWRoot\\pnp\\pnp\\Calculators\\"]
["ModuleName","CalculatorMacros.code"]
["Data set from BI","MDI_Pymt_Hist_Pure_Rates_yyyy"]